{"text_format":"1","workbook":"xlsx","n_sheets":9,"sheets":["Guide","Visualization","Values","Graphics","Calculation","Settings","Goal Seek","Directories","References"],"not_rendered":{"charts":29,"images":16,"macros":1,"external_links":0,"defined_names":81,"comments":1,"pivot_tables":0},"unopened":[],"bounds":{"document_bytes":16777216,"sheet_cells":100000,"rows_first":2000,"rows_last":500,"rows_between":2000,"halvings":0,"cell_chars":16384,"cell_head_chars":4096},"cells_cut":0,"cells_raw":0,"read":"whole","date_system":"1900"}

{"sheet":"Guide","index":0,"n_rows":188,"n_cols":7,"rows_kept":188,"cut":false,"hidden":true,"merged":[[314,1,319,8],[168,6,170,8],[174,6,175,8],[228,6,228,8],[230,6,232,8],[236,6,238,8],[123,1,123,2],[123,3,123,7],[270,2,272,7],[283,2,285,7],[296,6,300,8],[159,6,161,8],[163,6,165,8],[150,1,150,2],[150,3,150,7],[151,1,151,2],[151,3,151,8],[152,1,152,2],[152,3,152,7],[4,2,4,8],[5,1,5,8],[9,3,9,6],[25,3,26,7],[27,3,28,7],[29,1,29,2],[29,3,29,7],[31,1,31,2],[31,3,31,7],[32,3,35,7],[36,3,37,7],[38,3,39,7],[59,2,59,7],[58,2,58,7],[124,1,124,2],[124,3,124,7],[62,2,63,7],[80,1,81,7],[40,3,41,7],[56,2,57,7],[60,2,60,7],[61,2,61,7],[64,2,65,7],[93,2,93,7],[122,1,122,2],[122,3,122,7]]}
[]
[]
[]
[]
[null,"Important:"]
[null,"This file based on a Office 2010 version. For correct visualization and calculation use Office 2010 or higher."]
[]
[null,"Information:"]
{"$rows_left_out":181}
{"sheet":"Visualization","index":1,"n_rows":69,"n_cols":21,"rows_kept":69,"cut":false,"hidden":false,"merged":[[68,0,68,16],[54,13,54,14],[5,2,5,4],[12,2,12,4],[11,2,11,4],[51,13,51,14],[50,2,50,4],[51,2,51,4],[52,2,52,4],[13,2,13,4],[5,12,6,14],[22,2,23,5],[48,2,48,5],[53,13,53,14],[8,13,8,14],[31,2,31,3],[60,4,60,5],[57,6,57,11],[60,6,60,11],[59,6,59,8],[9,5,9,10],[10,5,10,10],[11,5,11,10],[12,5,12,10],[13,5,13,10],[19,9,19,10],[52,10,52,12],[53,10,53,12],[54,10,54,12],[50,5,50,8],[17,5,18,12],[22,11,22,12],[60,2,60,3],[9,13,9,14],[21,11,21,12],[10,13,10,14],[11,13,11,14],[13,13,13,14],[17,14,21,15],[14,2,14,4],[14,5,14,10],[25,2,25,3],[26,2,26,3],[27,2,27,3],[28,2,28,3],[29,2,29,3],[14,13,14,14],[12,13,12,14],[62,2,62,14],[19,2,19,4],[19,11,19,12],[20,11,20,12],[20,2,20,4],[21,2,21,4],[50,13,50,14],[52,13,52,14],[33,2,33,3],[53,2,53,4],[57,4,57,5],[57,2,57,3],[54,2,54,4],[56,6,56,8],[55,2,56,5],[51,5,51,8],[34,2,34,3],[32,2,32,3],[33,7,33,10],[34,7,34,10],[25,7,25,10],[26,7,26,10],[27,7,27,10],[28,7,28,10],[29,7,29,10],[30,7,30,10],[31,7,31,10],[32,7,32,10],[30,2,30,3],[8,2,8,4],[10,2,10,4],[9,2,9,4],[17,2,18,4],[21,5,21,7],[1,1,2,12],[52,5,52,8],[53,5,53,8],[54,5,54,8],[50,10,50,12],[51,10,51,12],[6,2,7,4],[5,5,5,10],[6,5,7,10],[8,5,8,10],[24,7,24,10],[24,2,24,3],[20,9,20,10],[21,9,21,10],[19,5,19,7],[20,5,20,7]]}
[]
[null,{"$f":"\"   \" & Values!B7","v":"   Machine capability analysis (MCA)"}]
[]
[]
[null,null,null,null,null,null,null,null,null,null,null,null,null,null,null,null,null,null,null,null,{"$f":"IF(OR($R$80=\"No\",$K$83<$K$79),1,\"\")","v":""}]
[null,null,"Location:",null,null,null,null,null,null,null,null,null,"Feature Independent"]
[null,null,"Line:"]
[]
{"$rows_left_out":62}
{"sheet":"Values","index":2,"n_rows":62,"n_cols":5,"rows_kept":62,"cut":false,"hidden":true,"merged":[[6,1,7,4],[4,1,4,3],[3,1,3,3]]}
[]
[]
[]
[null,"How many Parameters are measured?",null,null,"1 Parameter"]
[null,"Parts can be checked direktly after the manufaturing process?",null,null,"Yes"]
[]
[null,{"$f":"IF(E5=\"Yes\",\"Machine capability analysis (MCA)\",\"Process performance analysis (PPA)\")","v":"Machine capability analysis (MCA)"}]
[]
{"$rows_left_out":55}
{"sheet":"Graphics","index":3,"n_rows":130,"n_cols":21,"rows_kept":130,"cut":false,"hidden":false,"merged":[]}
[]
[]
[]
[]
[]
[]
[]
[]
{"$rows_left_out":123}
{"sheet":"Calculation","index":4,"n_rows":279,"n_cols":165,"rows_kept":279,"cut":false,"hidden":true,"merged":[[5,111,6,111],[5,143,6,143],[5,116,6,116],[5,117,6,117],[5,119,6,119],[5,112,5,113],[5,107,6,107],[5,108,6,108],[3,62,4,62],[3,63,4,63],[3,64,4,64],[3,65,4,65],[5,103,6,103],[5,104,6,104],[5,109,6,109],[5,110,6,110],[5,114,6,114],[5,115,6,115],[5,105,6,105],[114,165,115,165],[114,163,115,163],[114,164,115,164],[114,143,115,143],[60,149,61,149],[60,150,61,150],[60,151,61,151],[60,146,61,146],[5,158,6,158],[114,162,115,162],[114,144,115,145],[114,146,115,146],[114,147,115,147],[114,148,115,148],[114,149,115,149],[12,58,13,58],[10,50,11,51],[10,52,11,52],[10,53,11,53],[10,54,11,54],[10,55,11,55],[10,56,11,56],[5,118,6,118],[31,82,32,82],[15,82,15,83],[15,94,15,95],[15,91,15,92],[19,91,19,92],[15,85,15,86],[19,85,19,86],[15,97,15,98],[19,97,19,98],[31,85,32,85],[31,86,32,86],[31,88,32,88],[31,91,32,91],[31,92,32,92],[31,94,32,94],[31,95,32,95],[21,2,21,4],[22,2,22,4],[21,5,21,6],[22,5,22,6],[14,45,15,45],[14,46,15,46],[20,40,21,46],[16,46,17,46],[16,40,17,41],[16,42,17,42],[16,43,17,43],[16,44,17,44],[16,45,17,45],[16,8,17,9],[16,10,17,10],[18,2,18,4],[19,2,19,4],[18,5,18,6],[19,5,19,6],[14,14,15,14],[14,30,15,31],[14,32,15,32],[14,33,15,33],[14,34,15,34],[15,70,15,71],[14,50,15,51],[14,52,15,52],[14,53,15,53],[18,121,20,123],[52,52,53,52],[52,53,53,53],[52,55,53,58],[15,67,15,68],[31,70,32,70],[31,71,32,71],[15,73,15,74],[31,73,32,73],[31,74,32,74],[31,83,32,83],[15,100,15,101],[20,50,21,56],[19,73,19,74],[14,54,15,54],[31,76,32,76],[31,77,32,77],[16,53,17,53],[16,54,17,54],[16,55,17,55],[26,3,26,4],[27,3,27,4],[28,3,28,4],[114,154,115,154],[162,147,163,147],[114,156,115,156],[5,147,6,147],[5,156,6,156],[5,160,6,160],[5,148,6,148],[5,149,6,149],[5,150,6,150],[5,151,6,151],[114,160,115,160],[161,154,161,155],[114,155,115,155],[60,147,61,147],[114,150,115,150],[114,151,115,151],[60,148,61,148],[114,159,115,159],[114,158,115,158],[5,144,6,145],[5,146,6,146],[162,145,163,145],[31,79,32,79],[31,80,32,80],[15,79,15,80],[19,79,19,80],[60,143,61,143],[60,144,61,145],[49,125,50,125],[49,126,50,126],[49,128,50,128],[49,129,50,129],[49,131,50,131],[49,132,50,132],[49,134,50,134],[49,135,50,135],[49,137,50,137],[49,138,50,138],[15,121,16,121],[15,122,16,122],[15,123,16,123],[15,88,15,89],[31,93,32,93],[31,89,32,89],[5,50,7,51],[5,52,7,52],[5,53,5,54],[5,55,7,55],[5,56,7,56],[6,53,7,53],[6,54,7,54],[8,50,9,51],[8,52,9,52],[8,54,9,54],[8,55,9,55],[8,56,9,56],[8,53,9,53],[12,55,13,55],[12,56,13,56],[12,13,13,13],[12,14,13,14],[10,45,11,45],[12,38,13,38],[12,40,13,41],[12,42,13,42],[10,27,11,27],[12,27,13,27],[12,16,13,16],[12,30,13,31],[12,32,13,32],[12,33,13,33],[12,34,13,34],[12,35,13,35],[12,36,13,36],[16,30,17,31],[16,32,17,32],[16,33,17,33],[16,34,17,34],[16,35,17,35],[16,36,17,36],[20,30,21,36],[44,30,45,31],[44,32,45,32],[44,35,45,38],[227,13,228,13],[134,13,135,13],[189,14,189,16],[110,14,110,16],[174,15,174,16],[175,15,176,16],[190,14,190,16],[179,15,179,16],[180,15,181,16],[134,15,135,16],[232,13,233,13],[8,32,9,32],[8,33,9,33],[8,34,9,34],[8,35,9,35],[114,11,115,16],[254,8,278,8],[12,10,13,10],[14,10,15,10],[12,12,13,12],[14,12,15,12],[12,11,13,11],[14,11,15,11],[12,8,13,9],[14,8,15,9],[134,8,135,8],[134,9,135,9],[134,10,135,10],[121,8,122,9],[123,8,124,9],[123,10,124,10],[123,11,124,11],[20,8,21,14],[44,8,45,9],[246,15,246,16],[10,16,11,16],[5,40,7,41],[5,42,7,42],[5,43,5,44],[5,45,7,45],[5,46,7,46],[6,43,7,43],[5,30,7,31],[5,32,7,32],[5,33,5,34],[5,35,7,35],[5,36,7,36],[6,33,7,33],[6,34,7,34],[8,30,9,31],[6,44,7,44],[8,40,9,41],[8,42,9,42],[8,43,9,43],[8,44,9,44],[8,36,9,36],[10,30,11,31],[10,32,11,32],[247,15,247,16],[241,13,242,13],[243,15,243,16],[244,15,244,16],[111,14,111,16],[52,16,53,16],[31,67,32,67],[31,68,32,68],[19,67,19,68],[110,36,110,38],[111,36,111,38],[112,30,112,31],[113,30,114,31],[114,33,115,38],[44,40,45,41],[44,42,45,42],[44,45,45,48],[44,50,45,51],[44,52,45,52],[44,55,45,58],[182,35,183,35],[182,37,183,38],[237,13,238,13],[243,13,244,13],[16,56,17,56],[14,55,15,55],[14,56,15,56],[16,50,17,51],[16,52,17,52],[15,76,15,77],[10,33,11,33],[10,34,11,34],[10,35,11,35],[10,36,11,36],[10,38,11,38],[12,48,13,48],[14,43,15,43],[14,44,15,44],[10,48,11,48],[14,40,15,41],[14,42,15,42],[14,35,15,35],[14,36,15,36],[10,58,11,58],[12,50,13,51],[12,52,13,52],[12,53,13,53],[12,54,13,54],[8,45,9,45],[8,46,9,46],[10,40,11,41],[10,42,11,42],[10,43,11,43],[10,44,11,44],[10,46,11,46],[12,43,13,43],[12,44,13,44],[12,45,13,45],[12,46,13,46],[52,32,53,32],[52,33,53,33],[52,34,53,34],[52,35,53,35],[52,36,53,36],[52,37,53,37],[52,38,53,38],[121,31,122,31],[121,32,122,32],[121,33,122,33],[121,34,122,34],[121,35,122,35],[121,37,122,38],[107,36,107,37],[108,30,109,31],[108,36,108,37],[107,30,107,31],[121,30,122,30],[52,30,53,30],[52,31,53,31],[233,37,233,38],[234,37,234,38],[161,37,161,38],[162,37,163,38],[166,37,166,38],[167,37,168,38],[176,36,176,38],[177,36,177,38],[182,30,183,30],[182,31,183,31],[182,32,183,32],[182,33,183,33],[182,34,183,34],[214,35,215,35],[219,35,220,35],[224,35,225,35],[228,35,229,35],[230,35,231,35],[230,37,230,38],[231,37,231,38],[127,8,127,9],[128,8,128,9],[195,10,196,10],[195,11,196,11],[195,12,196,12],[195,13,196,13],[44,10,45,10],[44,13,45,16],[195,8,196,8],[195,15,196,16],[134,11,135,11],[134,12,135,12],[123,13,124,16],[195,9,196,9],[107,8,107,9],[108,8,109,9],[112,8,112,9],[113,8,114,9],[107,14,107,15],[108,14,108,15],[52,8,53,8],[52,9,53,9],[52,10,53,10],[52,11,53,11],[52,15,53,15],[52,12,53,12],[52,13,53,13],[52,14,53,14],[16,11,17,11],[16,12,17,12],[16,13,17,13],[16,14,17,14],[14,13,15,13],[3,4,4,4],[3,2,4,3],[5,8,7,9],[5,10,7,10],[5,11,5,12],[3,5,4,5],[5,13,7,13],[5,14,7,14],[6,11,7,11],[6,12,7,12],[8,14,9,14],[10,14,11,14],[8,8,9,9],[8,10,9,10],[8,11,9,11],[8,12,9,12],[8,13,9,13],[10,8,11,9],[10,10,11,10],[10,11,11,11],[10,12,11,12],[10,13,11,13],[52,19,53,20],[54,19,55,20],[54,21,55,21],[54,22,55,22],[54,24,55,27],[58,19,58,20],[59,19,59,20],[44,19,45,20],[44,21,45,21],[44,24,45,27],[6,23,7,23],[8,19,9,20],[8,21,9,21],[8,22,9,22],[8,23,9,23],[8,24,9,24],[8,25,9,25],[16,19,17,20],[16,21,17,21],[16,22,17,22],[16,23,17,23],[16,24,17,24],[16,25,17,25],[5,24,7,24],[5,25,7,25],[6,22,7,22],[252,10,252,36],[3,6,4,6],[10,19,11,20],[10,21,11,21],[10,22,11,22],[10,23,11,23],[10,24,11,24],[10,25,11,25],[12,19,13,20],[12,21,13,21],[12,22,13,22],[12,23,13,23],[12,24,13,24],[12,25,13,25],[14,19,15,20],[14,21,15,21],[14,22,15,22],[14,23,15,23],[14,24,15,24],[14,25,15,25],[5,19,7,20],[5,21,7,21],[20,19,21,25],[5,22,5,23],[56,50,56,51],[57,50,57,51],[50,40,51,41],[52,40,53,41],[52,42,53,42],[52,43,53,43],[52,45,53,48],[56,40,56,41],[57,40,57,41],[50,50,51,51],[52,50,53,51],[64,19,65,19],[115,52,115,53],[115,50,115,51],[115,55,115,56],[115,57,115,58],[118,19,118,20],[118,21,118,22],[118,24,118,25],[118,26,118,27],[64,20,65,20],[64,21,65,21],[64,22,65,22],[64,23,65,23],[64,24,65,24],[64,25,65,25],[64,26,65,26],[64,27,65,27],[61,50,62,50],[61,51,62,51],[61,52,62,52],[61,53,62,53],[61,54,62,54],[61,55,62,55],[61,56,62,56],[61,57,62,57],[61,58,62,58]]}
[]
[]
[]
[null,null,"Distribution",null,"Status of \n1 Parameter","Status of \n2 Parameter","Result",null,null,null,null,null,null,null,null,null,null,null,null,null,null,null,null,null,null,null,null,null,null,null,null,null,null,null,null,null,null,null,null,null,null,null,null,null,null,null,null,null,null,null,null,null,null,null,null,null,null,null,null,null,null,null,"Distribution","I-UEL or 99,865","I-LEL \nor 0,135","MR-UEL",null,null,null,null,null,null,null,null,null,null,null,null,null,null,null,null,null,null,null,null,null,null,null,null,null,null,null,null,null,null,null,null,null,null,null,null,null,null,null,null,null,null,null,null,null,null,null,null,null,null,null,null,null,null,null,"Number of pieces","Cm","Cmk"]
[null,null,null,null,null,null,null,null,null,null,null,null,null,null,null,null,null,null,null,null,null,null,null,null,null,null,null,null,null,null,null,null,null,null,null,null,null,null,null,null,null,null,null,null,null,null,null,null,null,null,null,null,null,null,null,null,null,null,null,null,null,null,null,null,null,null,null,null,null,null,null,null,null,null,null,null,null,null,null,null,null,null,null,null,null,null,null,null,null,null,null,null,null,null,null,null,null,null,null,null,null,null,null,null,null,null,null,null,null,null,null,null,null,null,null,null,null,null,null,null,null,50,{"$f":"IF(DT16=\"custom\",1.67,2)","v":2},1.67]
[null,"Normal","Normal",null,"Active","Inactive",{"$f":"IF(Visualization!F51=\"\",\"\",IF(IF(Values!$E$4=\"1 Parameter\",Calculation!E6,Calculation!F6)=\"Active\",Q13,\"\"))","v":""},null,"Tests",null,"Evaluation factor","Requested to use",null,"Normel distribution is proved","Result (number)",null,null,null,null,"Tests",null,"Evaluation factor","Requested to use",null,"Normel distribution is proved","Result (number)",null,null,null,null,"Tests",null,"Evaluation factor","Requested to use",null,"Normel distribution is proved","Result (number)",null,null,null,"Tests",null,"Evaluation factor","Requested to use",null,"Normel distribution is proved","Result (number)",null,null,null,"Tests",null,"Evaluation factor","Requested to use",null,"Normel distribution is proved","Result (number)",null,null,null,null,null,"Normal",{"$f":"BT17","v":""},{"$f":"BT18","v":""},{"$f":"BQ17","v":""},null,"I - Bar",{"$f":"IF(DA8=\"\",\"\",AVERAGE(DA8:DA57))","v":""},null,"MR - Bar",{"$f":"IF(BQ6=\"\",\"\",AVERAGE(DD9:DD57))","v":""},null,"I - Bar",{"$f":"BZ42","v":""},null,"MR - Bar",{"$f":"BT6","v":""},null,"I - Bar",{"$f":"CO6","v":""},null,"MR - Bar",{"$f":"BZ6","v":""},null,"I - Bar",{"$f":"IFERROR(AVERAGE(DB8:DB57),\"\")","v":""},null,"MR - Bar",{"$f":"IF(CI6=\"\",\"\",AVERAGE(DE9:DE57))","v":""},null,"I - Bar",{"$f":"CR42","v":""},null,"MR - Bar",{"$f":"BT6","v":""},null,"I - Bar",{"$f":"BQ6","v":""},null,"MR - Bar",{"$f":"BT6","v":""},null,"Nr.","I - Values","LN(I - Values)",null,"MR -\nValues","LN(MR -\nValues)","I - Average","MR - Average","Angle","Specification",null,"USL","LSL",{"$f":"IF(OR(Result_Distribution_1178=\"Normal\",Result_Distribution_1178=\"Lognormal\"),\"I-UEL\",IF(Result_Distribution_1178=\"Unkown\",\"\",\"99.865%\"))","v":"99.865%"},{"$f":"IF(OR(Result_Distribution_1178=\"Normal\",Result_Distribution_1178=\"Lognormal\"),\"I-LEL\",IF(Result_Distribution_1178=\"Unkown\",\"\",\"0.135%\"))","v":"0.135%"},{"$f":"IF(Result_Distribution_1178=\"Normal\",\"MR-UEL\",IF(Result_Distribution_1178=\"Lognormal\",\"MR-UEL\",IF(Result_Distribution_1178=\"Tunc-Normal\",\"\",IF(Result_Distribution_1178=\"Rayleigh\",\"\",IF(Result_Distribution_1178=\"Weibull\",\"\",\"\")))))","v":""},"Setpoint",null,{"$f":"IF(DT16=\"custom\",40,45)","v":45},{"$f":"IF(DT16=\"custom\",1.74,2.02)","v":2.02},{"$f":"IF(DT16=\"custom\",1.74,1.69)","v":1.69},null,null,null,null,null,null,null,null,null,null,null,null,null,null,null,null,null,null,null,"Classes","Values per class",null,"Number of values per class [%]","Number of values per class [%] (accumulated)","USL","LSL","Amount of classes","Set Point",null,"Y- Values","Expected",null,"Y- Values",null,"Y- Values",null,"Y- Values",null,"Y- Values",null,"Y- Values"]
[null,"Rayleigh 2P","Rayleigh",null,"Inactive","Active",{"$f":"IF(Visualization!F51=\"\",\"\",IF(IF(Values!$E$4=\"1 Parameter\",Calculation!E7,Calculation!F7)=\"Active\",AB13,\"\"))","v":""},null,null,null,null,"System (Secondary)","User (Primary)",null,null,null,null,null,null,null,null,null,"System (Secondary)","User (Primary)",null,null,null,null,null,null,null,null,null,"System (Secondary)","User (Primary)",null,null,null,null,null,null,null,null,"System (Secondary)","User (Primary)",null,null,null,null,null,null,null,null,"System (Secondary)","User (Primary)",null,null,null,null,null,null,null,"Rayleigh",{"$f":"BY36","v":""},{"$f":"BY34","v":""},"-",null,"I-Median",{"$f":"IF(DA8=\"\",\"\",MEDIAN(DA8:DA57))","v":""},null,"MR sigma",{"$f":"IF(BQ6=\"\",\"\",BT6/BS12)","v":""},null,"I-Median",{"$f":"BQ7","v":""},null,null,null,null,"I-Median",{"$f":"CO7","v":""},null,null,null,null,"I-Median",{"$f":"IFERROR(MEDIAN(DB8:DB57),\"\")","v":""},null,"MR sigma",{"$f":"IF(CI6=\"\",\"\",CL6/CK12)","v":""},null,"I-Median",{"$f":"BQ7","v":""},null,null,null,null,"I-Median",{"$f":"BQ7","v":""},null,null,null,null,null,null,null,null,null,null,null,null,null,"X","Y",null,null,null,null,null,null,null,{"$f":"IF(DT16=\"custom\",30,40)","v":40},{"$f":"IF(DT16=\"custom\",1.78,2.05)","v":2.0499999999999998},{"$f":"IF(DT16=\"custom\",1.78,1.72)","v":1.72},null,null,null,null,null,null,null,null,null,null,null,null,null,null,null,null,null,null,null,null,null,null,null,null,null,null,null,null,null,{"$f":"IF(DA8=\"\",\"\",NORMDIST($EN8,$BQ$6,$DW$14,0))","v":""},{"$f":"IF(EO8=\"\",\"\",NORMDIST($EN8,$BQ$6,$DW$14,1)*100)","v":""},null,null,null,null,null,null,null,{"$f":"IF(DA8=\"\",\"\",IFERROR(IF(EN8<=0,#N/A,((EXP(-((((EN8-$EC$28)/$EC$29)^2)/2))+EXP(-((((EN8+$EC$28)/$EC$29)^2)/2)))/($EC$29*SQRT(2*PI())))),#N/A))","v":""},null,{"$f":"IF(DA8=\"\",\"\",IF(EQ8=\"\",0,IF(EQ8=0,0,EQ8+3)))","v":""}]
[null,"Rayleigh 3P","Trunc-Normal",null,"Active","Inactive",{"$f":"IF(BQ6=\"\",\"\",IF(BQ6-3*DW14>0,\"NG\",IF(Visualization!F51=\"\",\"\",IF(IF(Values!$E$4=\"1 Parameter\",Calculation!E8,Calculation!F8)=\"Active\",AW13,\"\"))))","v":""},null,null,null,null,null,null,null,null,null,null,null,null,null,null,null,null,null,null,null,null,null,null,null,null,null,null,null,null,null,null,null,null,null,null,null,null,null,null,null,null,null,null,null,null,null,null,null,null,null,null,null,null,null,null,null,"Trunc-Normal",{"$f":"CE34","v":""},{"$f":"CE36","v":""},"-",null,null,null,null,null,null,null,null,null,null,null,null,null,null,null,null,null,null,null,null,null,null,null,null,null,null,null,null,null,null,null,null,null,null,null,null,null,{"$f":"IF(Values!C13=\"\",\"\",1)","v":""},{"$f":"IF(AND(Values!D13=\"\",Values!E13=\"\"),\"\",IF(Values!$E$4=\"1 Parameter\",Values!D13,SQRT(Values!D13^2+Values!E13^2)))","v":""},{"$f":"IF(DA8=\"\",\"\",LN(DA8))","v":""},null,{"$f":"IF(DA8=\"\",\"\",0)","v":""},{"$f":"IF(DA8=\"\",\"\",0)","v":""},{"$f":"IF(DA8=\"\",\"\",AVERAGE($DA$8:$DA$57))","v":""},{"$f":"IF(DD8=\"\",\"\",AVERAGE($DD$8:$DD$57))","v":""},0,{"$f":"SIN(RADIANS(DH8))*Visualization!$L$20+0","v":0},{"$f":"COS(RADIANS(DH8))*Visualization!$L$20","v":0},{"$f":"IF(DA8=\"\",\"\",_xlfn.NUMBERVALUE(Visualization!$L$20))","v":""},{"$f":"IF(DA8=\"\",\"\",_xlfn.NUMBERVALUE(Visualization!$L$21))","v":""},{"$f":"IFERROR(IF(VLOOKUP(Result_Distribution_1178,Calculation!BK6:BN10,2,FALSE)=\"-\",NA(),VLOOKUP(Result_Distribution_1178,Calculation!BK6:BN10,2,FALSE)),\"\")","v":""},{"$f":"IFERROR(IF(VLOOKUP(Result_Distribution_1178,Calculation!BK6:BN10,3,FALSE)=\"-\",NA(),VLOOKUP(Result_Distribution_1178,Calculation!BK6:BN10,3,FALSE)),\"\")","v":""},{"$f":"IFERROR(IF(VLOOKUP(Result_Distribution_1178,Calculation!BK6:BN10,4,FALSE)=\"-\",NA(),VLOOKUP(Result_Distribution_1178,Calculation!BK6:BN10,4,FALSE)),\"\")","v":""},{"$f":"IF(Visualization!$F$21=\"\",\"\",IF(DA8=\"\",\"\",_xlfn.NUMBERVALUE(Visualization!$F$21)))","v":""},null,{"$f":"IF(DT16=\"custom\",20,35)","v":35},{"$f":"IF(DT16=\"custom\",1.91,2.08)","v":2.08},{"$f":"IF(DT16=\"custom\",1.91,1.75)","v":1.75},null,"Number of values:",{"$f":"IF(DA8=\"\",\"\",COUNT(DA8:DA57))","v":""},null,"Number of values:",{"$f":"DW8","v":""},null,"Number of values:",{"$f":"DZ8","v":""},null,"Number of values:",{"$f":"EC8","v":""},null,"Number of values:",{"$f":"EF8","v":""},null,"Number of values:",{"$f":"EI8","v":""},null,{"$f":"IF(DA8=\"\",\"\",IF($DW$8<15,\"\",DW10-2*DW13))","v":""},{"$f":"IF(EN8=\"\",\"\",IF(OR(COUNT($DA$8:$DA$57)=EO6,EO6=\"\"),\"\",FREQUENCY($DA$8:$DA$57,EN8)))","v":""},{"$f":"EO8","v":""},{"$f":"IF(EP8=\"\",\"\",(100/(SUM($EP$8:$EP$27))*EP8))","v":""},{"$f":"IF(EP8=\"\",\"\",EQ8)","v":""},{"$f":"IF(ER8=\"\",\"\",_xlfn.NUMBERVALUE(Visualization!$L$20))","v":""},{"$f":"IF(ER8=\"\",\"\",_xlfn.NUMBERVALUE(Visualization!$L$21))","v":""},{"$f":"IF(EO8=\"\",\"\",MAX($EQ$8:$EQ$27))","v":""},{"$f":"IF(EU8=\"\",\"\",IF(Visualization!$F$21=\"\",0,Visualization!$F$21))","v":""},null,{"$f":"IF($DA$8=\"\",\"\",NORMDIST($EN9,$BQ$6,$DW$14,0))","v":""},{"$f":"IF(EO8=\"\",\"\",NORMDIST($EN9,$BQ$6,$DW$14,1)*100)","v":""},null,{"$f":"IF(DA8=\"\",\"\",IFERROR(_xlfn.WEIBULL.DIST(EN8,2,$CR$45,FALSE),\"#N/A\"))","v":""},null,{"$f":"IF(DA8=\"\",\"\",IFERROR(IF(EN8<0,NA(),_xlfn.LOGNORM.DIST(EN8,LN($BQ$6),LN($DW$14),FALSE)),NA()))","v":""},null,{"$f":"IF(DA8=\"\",\"\",_xlfn.WEIBULL.DIST(IF(EN8<0,NA(),EN8),$CR$44,$CR$45,FALSE))","v":""},null,{"$f":"IF($DA$8=\"\",\"\",IFERROR(IF(EN9<=0,#N/A,((EXP(-((((EN9-$EC$28)/$EC$29)^2)/2))+EXP(-((((EN9+$EC$28)/$EC$29)^2)/2)))/($EC$29*SQRT(2*PI())))),#N/A))","v":""},null,{"$f":"IF($DA$8=\"\",\"\",IF(EQ9=\"\",0,IF(EQ9=0,0,EQ9+3)))","v":""}]
{"$rows_left_out":272}
{"sheet":"Settings","index":5,"n_rows":26,"n_cols":8,"rows_kept":26,"cut":false,"hidden":true,"merged":[[27,7,28,10],[27,11,28,13],[25,7,26,10],[25,11,26,13],[16,1,16,5],[17,4,18,5],[19,4,19,5],[21,7,22,10],[21,11,22,13],[23,7,24,10],[23,11,24,13],[22,1,22,3],[19,7,20,10],[19,11,20,13],[13,4,13,5],[13,7,14,10],[6,7,8,13],[7,1,7,2],[7,3,7,5],[10,1,10,5],[11,4,12,5]]}
[]
[]
[]
[]
[]
[]
[null,null,null,null,null,null,null,"The integrated macros in this Worksheet are not required for the calculation. The macros just handle the scaling of the integrated charts. If you do not activate the macros, the sheet is still capable to calculate trustwothy indicies."]
[null,"Scale on",null,"Values"]
{"$rows_left_out":19}
{"sheet":"Goal Seek","index":6,"n_rows":56,"n_cols":13,"rows_kept":56,"cut":false,"hidden":true,"merged":[[6,10,6,11],[23,9,25,12],[5,10,5,11],[4,2,5,2],[13,10,13,12],[4,4,5,4],[18,9,19,12],[4,3,5,3],[4,5,4,6]]}
[]
[null,null,"Goal Seek Process"]
[]
[]
[null,null,"Values \n(Current)","Values (already calculated)","Check of Matching","Weibull"]
[null,null,null,null,null,"Epsilon-","Epsilon+",null,null,"Active Paramter","Epsilon Factor"]
[null,null,{"$f":"IFERROR(SMALL(Calculation!$DA$8:$DA$57,Calculation!CZ8),\"\")","v":""},6.0649493999999997,{"$f":"C7=D7","v":false},{"$f":"IF(C7=\"\",\"\",LN((($L$11-$L$12)*((C7-$M$11-$M$12)/($K$11-$K$12))^($L$11-1-$L$12)*EXP(-1*((C7-$M$11-$M$12)/($K$11-$K$12))^($L$11-$L$12)))/($K$11-$K$12)))","v":""},{"$f":"IF(C7=\"\",\"\",LN((($L$11+$L$12)*((C7-$M$11+$M$12)/($K$11+$K$12))^($L$11-1+$L$12)*EXP(-1*((C7-$M$11+$M$12)/($K$11+$K$12))^($L$11+$L$12)))/($K$11+$K$12)))","v":""},null,null,1,1E-3]
[null,null,{"$f":"IFERROR(SMALL(Calculation!$DA$8:$DA$57,Calculation!CZ9),\"\")","v":""},6.0649493999999997,{"$f":"C8=D8","v":false},{"$f":"IF(C8=\"\",\"\",LN((($L$11-$L$12)*((C8-$M$11-$M$12)/($K$11-$K$12))^($L$11-1-$L$12)*EXP(-1*((C8-$M$11-$M$12)/($K$11-$K$12))^($L$11-$L$12)))/($K$11-$K$12)))","v":""},{"$f":"IF(C8=\"\",\"\",LN((($L$11+$L$12)*((C8-$M$11+$M$12)/($K$11+$K$12))^($L$11-1+$L$12)*EXP(-1*((C8-$M$11+$M$12)/($K$11+$K$12))^($L$11+$L$12)))/($K$11+$K$12)))","v":""}]
{"$rows_left_out":49}
{"sheet":"Directories","index":7,"n_rows":18,"n_cols":6,"rows_kept":18,"cut":false,"hidden":true,"merged":[]}
[]
[]
[]
[null,"Resolution",null,"Unit",null,"Measurement system"]
[null,1,null,"µm",null,"Height Gauge"]
[null,0.5,null,"mm",null,"Precision scale"]
[null,0.1,null,"m",null,"Packing scale"]
[null,0.05,null,"Nm",null,"Flux measurment"]
{"$rows_left_out":11}
{"sheet":"References","index":8,"n_rows":13,"n_cols":2,"rows_kept":13,"cut":false,"hidden":true,"merged":[[3,1,8,9],[12,1,13,7]]}
[]
[]
[]
[null,"Calculation according software \"Minitab® 16.1.0\".\n\n©  2010 Minitab Inc.  All rights reserved.\nMINITAB®  and the MINITAB logo™  are trademarks of Minitab Inc.  All other marks referenced remain the property of their respective owners.\n\nPortions of this product were created using LEADTOOLS © 1991-2004, LEAD Technologies, Inc.  ALL RIGHTS RESERVED."]
[]
[]
[]
[]
{"$rows_left_out":5}