{"text_format":"1","workbook":"xlsx","n_sheets":9,"sheets":["Guide","Visualization","Values","Graphics","Calculation","Settings","Goal Seek","Directories","References"],"not_rendered":{"charts":29,"images":16,"macros":1,"external_links":0,"defined_names":81,"comments":1,"pivot_tables":0},"unopened":[],"bounds":{"document_bytes":16777216,"sheet_cells":100000,"rows_first":2000,"rows_last":500,"rows_between":2000,"halvings":0,"cell_chars":16384,"cell_head_chars":4096},"cells_cut":0,"cells_raw":0,"read":"whole","date_system":"1900"}

{"sheet":"Guide","index":0,"n_rows":188,"n_cols":7,"rows_kept":188,"cut":false,"hidden":true,"merged":[[314,1,319,8],[168,6,170,8],[174,6,175,8],[228,6,228,8],[230,6,232,8],[236,6,238,8],[123,1,123,2],[123,3,123,7],[270,2,272,7],[283,2,285,7],[296,6,300,8],[159,6,161,8],[163,6,165,8],[150,1,150,2],[150,3,150,7],[151,1,151,2],[151,3,151,8],[152,1,152,2],[152,3,152,7],[4,2,4,8],[5,1,5,8],[9,3,9,6],[25,3,26,7],[27,3,28,7],[29,1,29,2],[29,3,29,7],[31,1,31,2],[31,3,31,7],[32,3,35,7],[36,3,37,7],[38,3,39,7],[59,2,59,7],[58,2,58,7],[124,1,124,2],[124,3,124,7],[62,2,63,7],[80,1,81,7],[40,3,41,7],[56,2,57,7],[60,2,60,7],[61,2,61,7],[64,2,65,7],[93,2,93,7],[122,1,122,2],[122,3,122,7]]}
[]
[]
[]
[]
[null,"Important:"]
[null,"This file based on a Office 2010 version. For correct visualization and calculation use Office 2010 or higher."]
[]
[null,"Information:"]
[]
[null,null,null,"If a cell is gray, a input is required"]
[]
[]
[]
[]
[null,"1.1 Open register \"Visualization\""]
[]
[]
[]
[]
[]
[]
[]
[]
[]
[]
[null,"Location: ",null,"Enter the location where was capability was done. \nFor Example: Germany; PMDM Villingen"]
[]
[null,"Line:",null,"Enter the line/place where your measurment system is located.\nFor Example: BLDC Line or QCArea"]
[]
[null,"Machine-Type:",null,"Enter a clear understandable name for your machine."]
[null,"Machine-Number:",null,"Enter the Machine number (Inventory number)."]
[null,"Processnumber:",null,"Enter your processnumber according the Control Plan."]
[null,"Device-Typ:",null,"Enter a clear understandable name for your equipment. The name should correspond with your measurement equipment database.\nFor Example: Height gauge; Precision scale"]
[]
[]
[]
[null,"Device-Number:",null,"Enter the measurment equipment number where you can find in your measurement equipment database."]
[]
[null,"Resolution:",null,"Enter the Reolution of your System. \nFor Example: 0,001"]
[]
[null,"Date of Datacollection:",null,"Enter the date of the start and the date of the end of your analysis."]
[]
[]
[]
[]
[]
[]
[]
[]
[null,"These cells will be filled out by ProFile. Not relevant for suppliers."]
[]
[]
[]
[]
[]
[]
[null,"Feature:","Enter the name of the feature you checked. \nFor Example: Distance between ball bearings"]
[]
[null,"Unit:","Enter the unit which you detect with your measurment system"]
[null,"Setpoint:","Enter the position of the average your machine during the capcbility analysis."]
[null,"USL:","Enter Upper Sepcification Limit"]
[null,"LSL:","Enter Lower Specification Limit"]
[null,"Feature is limited:","Use the dropdown to select if the feature is limited on one side. An Example of a limited feature is the roughness of a surface (can not be smaller then 0)"]
[]
[null,"KPC:","Here you can enter the critical characteristic name in case the feature you are checking is a special characteristic. The DropDown allows you several options."]
[]
[]
[]
[]
[]
[null,"2.1 Open register \"Values\""]
[]
[]
[]
[]
[]
[]
[]
[]
[]
[null,"Decide if you can measure the parts directly after the production process. In case a second process needs to be perform before the parts can be measure, please change to \"No\"."]
[]
[]
[]
[]
[]
[]
[]
[]
[]
[]
[]
[]
[null,"I-Values:","Please enter all values into the column I-Values. The VDA standard is 50 values."]
[]
[]
[]
[null,"3.1 Open register \"Visualization\""]
[null,"3.2 Good Result"]
[]
[]
[]
[]
[]
[]
[]
[]
[]
[]
[]
[]
[]
[]
[]
[]
[]
[]
[]
[]
[]
[]
[]
[null,"Cm:",null,"Value is bigger den 2.00 and therfore fulfill the requirements."]
[null,"Cmk:",null,"Value is bigger den 1.67 and therfore fulfill the requirements."]
[null,"Test of normality:",null,"Values are normal distributed."]
[]
[null,"3.3 Bad Result"]
[]
[]
[]
[]
[]
[]
[]
[]
[]
[]
[]
[]
[]
[]
[]
[]
[]
[]
[]
[]
[]
[]
[]
[null,"Cm:",null,"Value is bigger den 2.00 and therfore fulfill the requirements."]
[null,"Cmk:",null,"Value is bigger den 1.67 and therfore fulfill the requirements."]
[null,"Test of normality:",null,"Values are not normal distributed."]
[]
[]
[]
[null,"Open register \"Settings\""]
[]
[]
[null,null,null,null,null,null,"Specify what the chart should scale to (Tolerance; Max/Min value; Custom)"]
[]
[]
[]
[null,null,null,null,null,null,"Change the scaling factor to adapt the distance to the specification limits."]
[]
[]
[]
[]
[null,null,null,null,null,null,"Change the scaling factor to adapt the distance to the max and min value."]
[]
[]
[]
[]
[]
[null,null,null,null,null,null,"Enter the data to which the chart should scale on"]
[]
[]
[]
[]
[]
[]
[]
[]
[]
[]
[]
[]
[null,"Hide or Unhide registers to have a more detailed view into background processes."]

{"sheet":"Visualization","index":1,"n_rows":69,"n_cols":21,"rows_kept":69,"cut":false,"hidden":false,"merged":[[68,0,68,16],[54,13,54,14],[5,2,5,4],[12,2,12,4],[11,2,11,4],[51,13,51,14],[50,2,50,4],[51,2,51,4],[52,2,52,4],[13,2,13,4],[5,12,6,14],[22,2,23,5],[48,2,48,5],[53,13,53,14],[8,13,8,14],[31,2,31,3],[60,4,60,5],[57,6,57,11],[60,6,60,11],[59,6,59,8],[9,5,9,10],[10,5,10,10],[11,5,11,10],[12,5,12,10],[13,5,13,10],[19,9,19,10],[52,10,52,12],[53,10,53,12],[54,10,54,12],[50,5,50,8],[17,5,18,12],[22,11,22,12],[60,2,60,3],[9,13,9,14],[21,11,21,12],[10,13,10,14],[11,13,11,14],[13,13,13,14],[17,14,21,15],[14,2,14,4],[14,5,14,10],[25,2,25,3],[26,2,26,3],[27,2,27,3],[28,2,28,3],[29,2,29,3],[14,13,14,14],[12,13,12,14],[62,2,62,14],[19,2,19,4],[19,11,19,12],[20,11,20,12],[20,2,20,4],[21,2,21,4],[50,13,50,14],[52,13,52,14],[33,2,33,3],[53,2,53,4],[57,4,57,5],[57,2,57,3],[54,2,54,4],[56,6,56,8],[55,2,56,5],[51,5,51,8],[34,2,34,3],[32,2,32,3],[33,7,33,10],[34,7,34,10],[25,7,25,10],[26,7,26,10],[27,7,27,10],[28,7,28,10],[29,7,29,10],[30,7,30,10],[31,7,31,10],[32,7,32,10],[30,2,30,3],[8,2,8,4],[10,2,10,4],[9,2,9,4],[17,2,18,4],[21,5,21,7],[1,1,2,12],[52,5,52,8],[53,5,53,8],[54,5,54,8],[50,10,50,12],[51,10,51,12],[6,2,7,4],[5,5,5,10],[6,5,7,10],[8,5,8,10],[24,7,24,10],[24,2,24,3],[20,9,20,10],[21,9,21,10],[19,5,19,7],[20,5,20,7]]}
[]
[null,{"$f":"\"   \" & Values!B7","v":"   Machine capability analysis (MCA)"}]
[]
[]
[null,null,null,null,null,null,null,null,null,null,null,null,null,null,null,null,null,null,null,null,{"$f":"IF(OR($R$80=\"No\",$K$83<$K$79),1,\"\")","v":""}]
[null,null,"Location:",null,null,null,null,null,null,null,null,null,"Feature Independent"]
[null,null,"Line:"]
[]
[null,null,"Machine-Type:",null,null,null,null,null,null,null,null,null,"Base ID:"]
[null,null,"Machine-Number:",null,null,null,null,null,null,null,null,null,"Revision:"]
[null,null,"Processnumber:",null,null,null,null,null,null,null,null,null,"Version:"]
[null,null,"Meas. System-Name:",null,null,null,null,null,null,null,null,null,"Released by (ID):"]
[null,null,"Meas. System-Nr.:",null,null,null,null,null,null,null,null,null,"Released by:"]
[null,null,"Resolution:",null,null,null,null,null,null,null,null,null,"Date of release:"]
[null,null,"Date of Datacollection:",null,null,null,null,null,null,null,null,null,"Doc. Status:"]
[]
[null,null,null,null,null,null,null,null,null,null,null,null,null,null,null,null,null,null,null,null,{"$f":"IF(OR($R$80=\"No\",$K$83<$K$79),1,\"\")","v":""}]
[null,null,"Feature:",null,null,null,null,null,null,null,null,null,null,null,"Feature \nDependent"]
[]
[null,null,"Unit:",null,null,null,null,null,null,"USL:"]
[null,null,"Setpoint:",null,null,null,null,null,null,"LSL:"]
[null,null,"Feature is limited:",null,null,null,null,null,null,"KPC"]
[null,null,"Measurement data",null,null,null,null,null,null,null,null,{"$f":"IF(OR(L22<>\"\",M22<>\"\"),\"Feature is special\",\"No KPC feature\")","v":"No KPC feature"}]
[]
[null,null,"1 - 10",null,null,"11 - 20",null,"21 - 30",null,null,null,null,"31 - 40",null,"41 - 50"]
[null,null,{"$f":"IF($F$14=\"Pro.File cell\",\"\",IF(Values!D13=\"\",\"\",IF($F$14=1,Values!D13,IF(Values!D13=\"\",\"\"\"\",FIXED(Values!D13,LEN($F$14)-2,FALSE)))))","v":""},null,null,{"$f":"IF($F$14=\"Pro.File cell\",\"\",IF(Values!D23=\"\",\"\",IF($F$14=1,Values!D23,IF(Values!D23=\"\",\"\",FIXED(Values!D23,LEN($F$14)-2,FALSE)))))","v":""},null,{"$f":"IF($F$14=\"Pro.File cell\",\"\",IF(Values!D33=\"\",\"\",IF($F$14=1,Values!D33,IF(Values!D33=\"\",\"\",FIXED(Values!D33,LEN($F$14)-2,FALSE)))))","v":""},null,null,null,null,{"$f":"IF($F$14=\"Pro.File cell\",\"\",IF(Values!D43=\"\",\"\",IF($F$14=1,Values!D43,IF(Values!D43=\"\",\"\",FIXED(Values!D43,LEN($F$14)-2,FALSE)))))","v":""},null,{"$f":"IF($F$14=\"Pro.File cell\",\"\",IF(Values!D53=\"\",\"\",IF($F$14=1,Values!D53,IF(Values!D53=\"\",\"\",FIXED(Values!D53,LEN($F$14)-2,FALSE)))))","v":""}]
[null,null,{"$f":"IF($F$14=\"Pro.File cell\",\"\",IF(Values!D14=\"\",\"\",IF($F$14=1,Values!D14,IF(Values!D14=\"\",\"\"\"\",FIXED(Values!D14,LEN($F$14)-2,FALSE)))))","v":""},null,null,{"$f":"IF($F$14=\"Pro.File cell\",\"\",IF(Values!D24=\"\",\"\",IF($F$14=1,Values!D24,IF(Values!D24=\"\",\"\",FIXED(Values!D24,LEN($F$14)-2,FALSE)))))","v":""},null,{"$f":"IF($F$14=\"Pro.File cell\",\"\",IF(Values!D34=\"\",\"\",IF($F$14=1,Values!D34,IF(Values!D34=\"\",\"\",FIXED(Values!D34,LEN($F$14)-2,FALSE)))))","v":""},null,null,null,null,{"$f":"IF($F$14=\"Pro.File cell\",\"\",IF(Values!D44=\"\",\"\",IF($F$14=1,Values!D44,IF(Values!D44=\"\",\"\",FIXED(Values!D44,LEN($F$14)-2,FALSE)))))","v":""},null,{"$f":"IF($F$14=\"Pro.File cell\",\"\",IF(Values!D54=\"\",\"\",IF($F$14=1,Values!D54,IF(Values!D54=\"\",\"\",FIXED(Values!D54,LEN($F$14)-2,FALSE)))))","v":""}]
[null,null,{"$f":"IF($F$14=\"Pro.File cell\",\"\",IF(Values!D15=\"\",\"\",IF($F$14=1,Values!D15,IF(Values!D15=\"\",\"\"\"\",FIXED(Values!D15,LEN($F$14)-2,FALSE)))))","v":""},null,null,{"$f":"IF($F$14=\"Pro.File cell\",\"\",IF(Values!D25=\"\",\"\",IF($F$14=1,Values!D25,IF(Values!D25=\"\",\"\",FIXED(Values!D25,LEN($F$14)-2,FALSE)))))","v":""},null,{"$f":"IF($F$14=\"Pro.File cell\",\"\",IF(Values!D35=\"\",\"\",IF($F$14=1,Values!D35,IF(Values!D35=\"\",\"\",FIXED(Values!D35,LEN($F$14)-2,FALSE)))))","v":""},null,null,null,null,{"$f":"IF($F$14=\"Pro.File cell\",\"\",IF(Values!D45=\"\",\"\",IF($F$14=1,Values!D45,IF(Values!D45=\"\",\"\",FIXED(Values!D45,LEN($F$14)-2,FALSE)))))","v":""},null,{"$f":"IF($F$14=\"Pro.File cell\",\"\",IF(Values!D55=\"\",\"\",IF($F$14=1,Values!D55,IF(Values!D55=\"\",\"\",FIXED(Values!D55,LEN($F$14)-2,FALSE)))))","v":""}]
[null,null,{"$f":"IF($F$14=\"Pro.File cell\",\"\",IF(Values!D16=\"\",\"\",IF($F$14=1,Values!D16,IF(Values!D16=\"\",\"\"\"\",FIXED(Values!D16,LEN($F$14)-2,FALSE)))))","v":""},null,null,{"$f":"IF($F$14=\"Pro.File cell\",\"\",IF(Values!D26=\"\",\"\",IF($F$14=1,Values!D26,IF(Values!D26=\"\",\"\",FIXED(Values!D26,LEN($F$14)-2,FALSE)))))","v":""},null,{"$f":"IF($F$14=\"Pro.File cell\",\"\",IF(Values!D36=\"\",\"\",IF($F$14=1,Values!D36,IF(Values!D36=\"\",\"\",FIXED(Values!D36,LEN($F$14)-2,FALSE)))))","v":""},null,null,null,null,{"$f":"IF($F$14=\"Pro.File cell\",\"\",IF(Values!D46=\"\",\"\",IF($F$14=1,Values!D46,IF(Values!D46=\"\",\"\",FIXED(Values!D46,LEN($F$14)-2,FALSE)))))","v":""},null,{"$f":"IF($F$14=\"Pro.File cell\",\"\",IF(Values!D56=\"\",\"\",IF($F$14=1,Values!D56,IF(Values!D56=\"\",\"\",FIXED(Values!D56,LEN($F$14)-2,FALSE)))))","v":""}]
[null,null,{"$f":"IF($F$14=\"Pro.File cell\",\"\",IF(Values!D17=\"\",\"\",IF($F$14=1,Values!D17,IF(Values!D17=\"\",\"\"\"\",FIXED(Values!D17,LEN($F$14)-2,FALSE)))))","v":""},null,null,{"$f":"IF($F$14=\"Pro.File cell\",\"\",IF(Values!D27=\"\",\"\",IF($F$14=1,Values!D27,IF(Values!D27=\"\",\"\",FIXED(Values!D27,LEN($F$14)-2,FALSE)))))","v":""},null,{"$f":"IF($F$14=\"Pro.File cell\",\"\",IF(Values!D37=\"\",\"\",IF($F$14=1,Values!D37,IF(Values!D37=\"\",\"\",FIXED(Values!D37,LEN($F$14)-2,FALSE)))))","v":""},null,null,null,null,{"$f":"IF($F$14=\"Pro.File cell\",\"\",IF(Values!D47=\"\",\"\",IF($F$14=1,Values!D47,IF(Values!D47=\"\",\"\",FIXED(Values!D47,LEN($F$14)-2,FALSE)))))","v":""},null,{"$f":"IF($F$14=\"Pro.File cell\",\"\",IF(Values!D57=\"\",\"\",IF($F$14=1,Values!D57,IF(Values!D57=\"\",\"\",FIXED(Values!D57,LEN($F$14)-2,FALSE)))))","v":""}]
[null,null,{"$f":"IF($F$14=\"Pro.File cell\",\"\",IF(Values!D18=\"\",\"\",IF($F$14=1,Values!D18,IF(Values!D18=\"\",\"\"\"\",FIXED(Values!D18,LEN($F$14)-2,FALSE)))))","v":""},null,null,{"$f":"IF($F$14=\"Pro.File cell\",\"\",IF(Values!D28=\"\",\"\",IF($F$14=1,Values!D28,IF(Values!D28=\"\",\"\",FIXED(Values!D28,LEN($F$14)-2,FALSE)))))","v":""},null,{"$f":"IF($F$14=\"Pro.File cell\",\"\",IF(Values!D38=\"\",\"\",IF($F$14=1,Values!D38,IF(Values!D38=\"\",\"\",FIXED(Values!D38,LEN($F$14)-2,FALSE)))))","v":""},null,null,null,null,{"$f":"IF($F$14=\"Pro.File cell\",\"\",IF(Values!D48=\"\",\"\",IF($F$14=1,Values!D48,IF(Values!D48=\"\",\"\",FIXED(Values!D48,LEN($F$14)-2,FALSE)))))","v":""},null,{"$f":"IF($F$14=\"Pro.File cell\",\"\",IF(Values!D58=\"\",\"\",IF($F$14=1,Values!D58,IF(Values!D58=\"\",\"\",FIXED(Values!D58,LEN($F$14)-2,FALSE)))))","v":""}]
[null,null,{"$f":"IF($F$14=\"Pro.File cell\",\"\",IF(Values!D19=\"\",\"\",IF($F$14=1,Values!D19,IF(Values!D19=\"\",\"\"\"\",FIXED(Values!D19,LEN($F$14)-2,FALSE)))))","v":""},null,null,{"$f":"IF($F$14=\"Pro.File cell\",\"\",IF(Values!D29=\"\",\"\",IF($F$14=1,Values!D29,IF(Values!D29=\"\",\"\",FIXED(Values!D29,LEN($F$14)-2,FALSE)))))","v":""},null,{"$f":"IF($F$14=\"Pro.File cell\",\"\",IF(Values!D39=\"\",\"\",IF($F$14=1,Values!D39,IF(Values!D39=\"\",\"\",FIXED(Values!D39,LEN($F$14)-2,FALSE)))))","v":""},null,null,null,null,{"$f":"IF($F$14=\"Pro.File cell\",\"\",IF(Values!D49=\"\",\"\",IF($F$14=1,Values!D49,IF(Values!D49=\"\",\"\",FIXED(Values!D49,LEN($F$14)-2,FALSE)))))","v":""},null,{"$f":"IF($F$14=\"Pro.File cell\",\"\",IF(Values!D59=\"\",\"\",IF($F$14=1,Values!D59,IF(Values!D59=\"\",\"\",FIXED(Values!D59,LEN($F$14)-2,FALSE)))))","v":""}]
[null,null,{"$f":"IF($F$14=\"Pro.File cell\",\"\",IF(Values!D20=\"\",\"\",IF($F$14=1,Values!D20,IF(Values!D20=\"\",\"\"\"\",FIXED(Values!D20,LEN($F$14)-2,FALSE)))))","v":""},null,null,{"$f":"IF($F$14=\"Pro.File cell\",\"\",IF(Values!D30=\"\",\"\",IF($F$14=1,Values!D30,IF(Values!D30=\"\",\"\",FIXED(Values!D30,LEN($F$14)-2,FALSE)))))","v":""},null,{"$f":"IF($F$14=\"Pro.File cell\",\"\",IF(Values!D40=\"\",\"\",IF($F$14=1,Values!D40,IF(Values!D40=\"\",\"\",FIXED(Values!D40,LEN($F$14)-2,FALSE)))))","v":""},null,null,null,null,{"$f":"IF($F$14=\"Pro.File cell\",\"\",IF(Values!D50=\"\",\"\",IF($F$14=1,Values!D50,IF(Values!D50=\"\",\"\",FIXED(Values!D50,LEN($F$14)-2,FALSE)))))","v":""},null,{"$f":"IF($F$14=\"Pro.File cell\",\"\",IF(Values!D60=\"\",\"\",IF($F$14=1,Values!D60,IF(Values!D60=\"\",\"\",FIXED(Values!D60,LEN($F$14)-2,FALSE)))))","v":""}]
[null,null,{"$f":"IF($F$14=\"Pro.File cell\",\"\",IF(Values!D21=\"\",\"\",IF($F$14=1,Values!D21,IF(Values!D21=\"\",\"\"\"\",FIXED(Values!D21,LEN($F$14)-2,FALSE)))))","v":""},null,null,{"$f":"IF($F$14=\"Pro.File cell\",\"\",IF(Values!D31=\"\",\"\",IF($F$14=1,Values!D31,IF(Values!D31=\"\",\"\",FIXED(Values!D31,LEN($F$14)-2,FALSE)))))","v":""},null,{"$f":"IF($F$14=\"Pro.File cell\",\"\",IF(Values!D41=\"\",\"\",IF($F$14=1,Values!D41,IF(Values!D41=\"\",\"\",FIXED(Values!D41,LEN($F$14)-2,FALSE)))))","v":""},null,null,null,null,{"$f":"IF($F$14=\"Pro.File cell\",\"\",IF(Values!D51=\"\",\"\",IF($F$14=1,Values!D51,IF(Values!D51=\"\",\"\",FIXED(Values!D51,LEN($F$14)-2,FALSE)))))","v":""},null,{"$f":"IF($F$14=\"Pro.File cell\",\"\",IF(Values!D61=\"\",\"\",IF($F$14=1,Values!D61,IF(Values!D61=\"\",\"\",FIXED(Values!D61,LEN($F$14)-2,FALSE)))))","v":""}]
[null,null,{"$f":"IF($F$14=\"Pro.File cell\",\"\",IF(Values!D22=\"\",\"\",IF($F$14=1,Values!D22,IF(Values!D22=\"\",\"\"\"\",FIXED(Values!D22,LEN($F$14)-2,FALSE)))))","v":""},null,null,{"$f":"IF($F$14=\"Pro.File cell\",\"\",IF(Values!D32=\"\",\"\",IF($F$14=1,Values!D32,IF(Values!D32=\"\",\"\",FIXED(Values!D32,LEN($F$14)-2,FALSE)))))","v":""},null,{"$f":"IF($F$14=\"Pro.File cell\",\"\",IF(Values!D42=\"\",\"\",IF($F$14=1,Values!D42,IF(Values!D42=\"\",\"\",FIXED(Values!D42,LEN($F$14)-2,FALSE)))))","v":""},null,null,null,null,{"$f":"IF($F$14=\"Pro.File cell\",\"\",IF(Values!D52=\"\",\"\",IF($F$14=1,Values!D52,IF(Values!D52=\"\",\"\",FIXED(Values!D52,LEN($F$14)-2,FALSE)))))","v":""},null,{"$f":"IF($F$14=\"Pro.File cell\",\"\",IF(Values!D62=\"\",\"\",IF($F$14=1,Values!D62,IF(Values!D62=\"\",\"\",FIXED(Values!D62,LEN($F$14)-2,FALSE)))))","v":""}]
[]
[]
[]
[]
[]
[]
[]
[]
[]
[]
[]
[]
[]
[null,null,"Characteristics"]
[null,null,null,null,null,null,null,null,null,null,null,null,null,null,null,null,null,null,null,null,{"$f":"IF(OR($R$80=\"No\",$K$83<$K$79),1,\"\")","v":""}]
[null,null,"Average:",null,null,{"$f":"IF(COUNT(Values!D13:D62)<20,\"\",AVERAGE(Values!D13:D62))","v":""},null,null,null,null,"        Max. Value:",null,null,{"$f":"IF(COUNT(Values!D13:D62)<20,\"\",MAX(Values!D13:D62))","v":""}]
[null,null,"Span:",null,null,{"$f":"IF(COUNT(Values!D13:D62)<20,\"\",N51-N52)","v":""},null,null,null,null,"        Min. Value:",null,null,{"$f":"IF(COUNT(Values!D13:D62)<20,\"\",MIN(Values!D13:D62))","v":""}]
[null,null,"Deviation:",null,null,{"$f":"IF(COUNT(Values!D13:D62)<20,\"\",STDEV(Values!D13:D62))","v":""},null,null,null,null,"        ∆ critical:",null,null,{"$f":"IF(COUNT(Values!D13:D62)<20,\"\",MIN(L20-F51,F51-L21))","v":""}]
[null,null,{"$f":"IF(Values!E5=\"Yes\",\"Cm   Min. Spec. (Δ):\",\"Pp   Min. Spec. (Δ):\")","v":"Cm   Min. Spec. (Δ):"},null,null,{"$f":"IF(COUNT(Values!D13:D62)<20,\"\",G57*6*F53)","v":""},null,null,null,null,{"$f":"IF(Values!E5=\"Yes\",\"        Cm   Max. sigma:\",\"        Pp   Max. sigma:\")","v":"        Cm   Max. sigma:"},null,null,{"$f":"IF(COUNT(Values!D13:D62)<20,\"\",(L20-L21)/(6*G57))","v":""}]
[null,null,{"$f":"IF(Values!E5=\"Yes\",\"Cmk Min. ∆ critical:\",\"Ppk Min. ∆ critica\")","v":"Cmk Min. ∆ critical:"},null,null,{"$f":"IF(COUNT(Values!D13:D62)<20,\"\",G57*3*F53)","v":""},null,null,null,null,{"$f":"IF(Values!E5=\"Yes\",\"        Cmk Max. sigma:\",\"        Ppk Max. sigma:\")","v":"        Cmk Max. sigma:"},null,null,{"$f":"IF(COUNT(Values!D13:D62)<20,\"\",N53/(3*G57))","v":""}]
[null,null,"Specifications"]
[null,null,null,null,null,null,{"$f":"CmPp","v":2.02},null,null,null,null,null,null,null,"Distribution"]
[null,null,{"$f":"IF(Values!E5=\"Yes\",IF(Result_CmPp_1178=\"\",\"Cm = ∞\",\"Cm = \" & ROUND(Result_CmPp_1178,2)),IF(Result_CmPp_1178=\"\",\"Pp = ∞\",\"Pp = \" & ROUND(Result_CmPp_1178,2)))","v":"Cm = ∞"},null,{"$f":"IF(G58=\"\",\"\",IF(G58>=G57,\"VAL\",G58))","v":""},null,{"$f":"IFERROR(ROUND(Calculation!F22,2),\"\")","v":""},null,null,null,null,null,null,null,{"$f":"IF(F51=\"\",\"\",IF(Calculation!F20=\"\",Calculation!F19,Calculation!F20))","v":""}]
[]
[null,null,null,null,null,null,{"$f":"CmkPpk","v":1.69},null,null,null,null,null,null,null,"Capability"]
[null,null,{"$f":"IFERROR(IF(Values!E5=\"Yes\",\"Cmk = \"&ROUND(Result_CmkPpk_1178,2),\"Ppk = \"&ROUND(Result_CmkPpk_1178,2)),\"Cmk\")","v":"Cmk"},null,{"$f":"IF(G61=\"\",\"\",IF(G61>=G60,\"VAL\",G61))","v":""},null,{"$f":"IFERROR(ROUND(Calculation!F23,2),\"\")","v":""},null,null,null,null,null,null,null,{"$f":"IF(F51=\"\",\"\",IF(COUNTIF(Calculation!D27:E29,\"Pass\")=3,\"Approved\",\"NG\"))","v":""}]
[]
[null,null,{"$f":"IF(Calculation!F20=Calculation!F19,\"\",IF(Influence=1,\"Info: User influenced the distribution calculation!\",\"\"))","v":""}]
[]
[]
[]
[]
[]
["Please enter the collected measured values into the register \"Values\""]

{"sheet":"Values","index":2,"n_rows":62,"n_cols":5,"rows_kept":62,"cut":false,"hidden":true,"merged":[[6,1,7,4],[4,1,4,3],[3,1,3,3]]}
[]
[]
[]
[null,"How many Parameters are measured?",null,null,"1 Parameter"]
[null,"Parts can be checked direktly after the manufaturing process?",null,null,"Yes"]
[]
[null,{"$f":"IF(E5=\"Yes\",\"Machine capability analysis (MCA)\",\"Process performance analysis (PPA)\")","v":"Machine capability analysis (MCA)"}]
[]
[]
[]
[]
[null,null,"Nr.",{"$f":"IF(E4=\"1 Parameter\",\"I-Values\",\"X-Values\")","v":"I-Values"},{"$f":"IF(E4=\"1 Parameter\",\"\",\"Y-Values\")","v":""}]
[null,null,{"$f":"IF(D13=\"\",\"\",1)","v":""}]
[null,null,{"$f":"IF(D14=\"\",\"\",C13+1)","v":""}]
[null,null,{"$f":"IF(D15=\"\",\"\",C14+1)","v":""}]
[null,null,""]
[null,null,""]
[null,null,""]
[null,null,""]
[null,null,""]
[null,null,""]
[null,null,""]
[null,null,""]
[null,null,""]
[null,null,""]
[null,null,""]
[null,null,""]
[null,null,""]
[null,null,""]
[null,null,""]
[null,null,""]
[null,null,""]
[null,null,""]
[null,null,""]
[null,null,""]
[null,null,""]
[null,null,""]
[null,null,""]
[null,null,""]
[null,null,""]
[null,null,""]
[null,null,""]
[null,null,""]
[null,null,""]
[null,null,""]
[null,null,""]
[null,null,""]
[null,null,""]
[null,null,""]
[null,null,""]
[null,null,""]
[null,null,""]
[null,null,""]
[null,null,""]
[null,null,""]
[null,null,""]
[null,null,""]
[null,null,""]
[null,null,""]
[null,null,""]
[null,null,""]
[null,null,""]

{"sheet":"Graphics","index":3,"n_rows":130,"n_cols":21,"rows_kept":130,"cut":false,"hidden":false,"merged":[]}
[]
[]
[]
[]
[]
[]
[]
[]
[]
[]
[]
[]
[]
[]
[]
[]
[]
[]
[]
[]
[]
[]
[]
[]
[]
[]
[]
[]
[]
[]
[]
[]
[]
[]
[]
[]
[]
[]
[]
[]
[]
[]
[]
[]
[]
[]
[]
[]
[]
[]
[]
[]
[]
[]
[]
[]
[]
[]
[]
[]
[]
[]
[]
[]
[]
[]
[]
[]
[]
[]
[]
[]
[]
[]
[]
[]
[]
[]
[null,null,null,null,null,null,null,null,null,null,null,null,null,null,null,null,null,null,null,null," "]
[]
[]
[]
[]
[]
[]
[]
[]
[]
[]
[]
[]
[]
[]
[]
[]
[]
[]
[]
[]
[]
[]
[]
[]
[]
[]
[]
[]
[]
[]
[]
[]
[]
[]
[]
[]
[]
[]
[]
[]
[]
[]
[]
[]
[]
[]
[]
[]
[]
[]
[null,null,{"$f":"IF(Values!E5=\"Yes\",\"Cm; Cmk\",\"Pp; Ppk\")","v":"Cm; Cmk"}]

{"sheet":"Calculation","index":4,"n_rows":279,"n_cols":165,"rows_kept":279,"cut":false,"hidden":true,"merged":[[5,111,6,111],[5,143,6,143],[5,116,6,116],[5,117,6,117],[5,119,6,119],[5,112,5,113],[5,107,6,107],[5,108,6,108],[3,62,4,62],[3,63,4,63],[3,64,4,64],[3,65,4,65],[5,103,6,103],[5,104,6,104],[5,109,6,109],[5,110,6,110],[5,114,6,114],[5,115,6,115],[5,105,6,105],[114,165,115,165],[114,163,115,163],[114,164,115,164],[114,143,115,143],[60,149,61,149],[60,150,61,150],[60,151,61,151],[60,146,61,146],[5,158,6,158],[114,162,115,162],[114,144,115,145],[114,146,115,146],[114,147,115,147],[114,148,115,148],[114,149,115,149],[12,58,13,58],[10,50,11,51],[10,52,11,52],[10,53,11,53],[10,54,11,54],[10,55,11,55],[10,56,11,56],[5,118,6,118],[31,82,32,82],[15,82,15,83],[15,94,15,95],[15,91,15,92],[19,91,19,92],[15,85,15,86],[19,85,19,86],[15,97,15,98],[19,97,19,98],[31,85,32,85],[31,86,32,86],[31,88,32,88],[31,91,32,91],[31,92,32,92],[31,94,32,94],[31,95,32,95],[21,2,21,4],[22,2,22,4],[21,5,21,6],[22,5,22,6],[14,45,15,45],[14,46,15,46],[20,40,21,46],[16,46,17,46],[16,40,17,41],[16,42,17,42],[16,43,17,43],[16,44,17,44],[16,45,17,45],[16,8,17,9],[16,10,17,10],[18,2,18,4],[19,2,19,4],[18,5,18,6],[19,5,19,6],[14,14,15,14],[14,30,15,31],[14,32,15,32],[14,33,15,33],[14,34,15,34],[15,70,15,71],[14,50,15,51],[14,52,15,52],[14,53,15,53],[18,121,20,123],[52,52,53,52],[52,53,53,53],[52,55,53,58],[15,67,15,68],[31,70,32,70],[31,71,32,71],[15,73,15,74],[31,73,32,73],[31,74,32,74],[31,83,32,83],[15,100,15,101],[20,50,21,56],[19,73,19,74],[14,54,15,54],[31,76,32,76],[31,77,32,77],[16,53,17,53],[16,54,17,54],[16,55,17,55],[26,3,26,4],[27,3,27,4],[28,3,28,4],[114,154,115,154],[162,147,163,147],[114,156,115,156],[5,147,6,147],[5,156,6,156],[5,160,6,160],[5,148,6,148],[5,149,6,149],[5,150,6,150],[5,151,6,151],[114,160,115,160],[161,154,161,155],[114,155,115,155],[60,147,61,147],[114,150,115,150],[114,151,115,151],[60,148,61,148],[114,159,115,159],[114,158,115,158],[5,144,6,145],[5,146,6,146],[162,145,163,145],[31,79,32,79],[31,80,32,80],[15,79,15,80],[19,79,19,80],[60,143,61,143],[60,144,61,145],[49,125,50,125],[49,126,50,126],[49,128,50,128],[49,129,50,129],[49,131,50,131],[49,132,50,132],[49,134,50,134],[49,135,50,135],[49,137,50,137],[49,138,50,138],[15,121,16,121],[15,122,16,122],[15,123,16,123],[15,88,15,89],[31,93,32,93],[31,89,32,89],[5,50,7,51],[5,52,7,52],[5,53,5,54],[5,55,7,55],[5,56,7,56],[6,53,7,53],[6,54,7,54],[8,50,9,51],[8,52,9,52],[8,54,9,54],[8,55,9,55],[8,56,9,56],[8,53,9,53],[12,55,13,55],[12,56,13,56],[12,13,13,13],[12,14,13,14],[10,45,11,45],[12,38,13,38],[12,40,13,41],[12,42,13,42],[10,27,11,27],[12,27,13,27],[12,16,13,16],[12,30,13,31],[12,32,13,32],[12,33,13,33],[12,34,13,34],[12,35,13,35],[12,36,13,36],[16,30,17,31],[16,32,17,32],[16,33,17,33],[16,34,17,34],[16,35,17,35],[16,36,17,36],[20,30,21,36],[44,30,45,31],[44,32,45,32],[44,35,45,38],[227,13,228,13],[134,13,135,13],[189,14,189,16],[110,14,110,16],[174,15,174,16],[175,15,176,16],[190,14,190,16],[179,15,179,16],[180,15,181,16],[134,15,135,16],[232,13,233,13],[8,32,9,32],[8,33,9,33],[8,34,9,34],[8,35,9,35],[114,11,115,16],[254,8,278,8],[12,10,13,10],[14,10,15,10],[12,12,13,12],[14,12,15,12],[12,11,13,11],[14,11,15,11],[12,8,13,9],[14,8,15,9],[134,8,135,8],[134,9,135,9],[134,10,135,10],[121,8,122,9],[123,8,124,9],[123,10,124,10],[123,11,124,11],[20,8,21,14],[44,8,45,9],[246,15,246,16],[10,16,11,16],[5,40,7,41],[5,42,7,42],[5,43,5,44],[5,45,7,45],[5,46,7,46],[6,43,7,43],[5,30,7,31],[5,32,7,32],[5,33,5,34],[5,35,7,35],[5,36,7,36],[6,33,7,33],[6,34,7,34],[8,30,9,31],[6,44,7,44],[8,40,9,41],[8,42,9,42],[8,43,9,43],[8,44,9,44],[8,36,9,36],[10,30,11,31],[10,32,11,32],[247,15,247,16],[241,13,242,13],[243,15,243,16],[244,15,244,16],[111,14,111,16],[52,16,53,16],[31,67,32,67],[31,68,32,68],[19,67,19,68],[110,36,110,38],[111,36,111,38],[112,30,112,31],[113,30,114,31],[114,33,115,38],[44,40,45,41],[44,42,45,42],[44,45,45,48],[44,50,45,51],[44,52,45,52],[44,55,45,58],[182,35,183,35],[182,37,183,38],[237,13,238,13],[243,13,244,13],[16,56,17,56],[14,55,15,55],[14,56,15,56],[16,50,17,51],[16,52,17,52],[15,76,15,77],[10,33,11,33],[10,34,11,34],[10,35,11,35],[10,36,11,36],[10,38,11,38],[12,48,13,48],[14,43,15,43],[14,44,15,44],[10,48,11,48],[14,40,15,41],[14,42,15,42],[14,35,15,35],[14,36,15,36],[10,58,11,58],[12,50,13,51],[12,52,13,52],[12,53,13,53],[12,54,13,54],[8,45,9,45],[8,46,9,46],[10,40,11,41],[10,42,11,42],[10,43,11,43],[10,44,11,44],[10,46,11,46],[12,43,13,43],[12,44,13,44],[12,45,13,45],[12,46,13,46],[52,32,53,32],[52,33,53,33],[52,34,53,34],[52,35,53,35],[52,36,53,36],[52,37,53,37],[52,38,53,38],[121,31,122,31],[121,32,122,32],[121,33,122,33],[121,34,122,34],[121,35,122,35],[121,37,122,38],[107,36,107,37],[108,30,109,31],[108,36,108,37],[107,30,107,31],[121,30,122,30],[52,30,53,30],[52,31,53,31],[233,37,233,38],[234,37,234,38],[161,37,161,38],[162,37,163,38],[166,37,166,38],[167,37,168,38],[176,36,176,38],[177,36,177,38],[182,30,183,30],[182,31,183,31],[182,32,183,32],[182,33,183,33],[182,34,183,34],[214,35,215,35],[219,35,220,35],[224,35,225,35],[228,35,229,35],[230,35,231,35],[230,37,230,38],[231,37,231,38],[127,8,127,9],[128,8,128,9],[195,10,196,10],[195,11,196,11],[195,12,196,12],[195,13,196,13],[44,10,45,10],[44,13,45,16],[195,8,196,8],[195,15,196,16],[134,11,135,11],[134,12,135,12],[123,13,124,16],[195,9,196,9],[107,8,107,9],[108,8,109,9],[112,8,112,9],[113,8,114,9],[107,14,107,15],[108,14,108,15],[52,8,53,8],[52,9,53,9],[52,10,53,10],[52,11,53,11],[52,15,53,15],[52,12,53,12],[52,13,53,13],[52,14,53,14],[16,11,17,11],[16,12,17,12],[16,13,17,13],[16,14,17,14],[14,13,15,13],[3,4,4,4],[3,2,4,3],[5,8,7,9],[5,10,7,10],[5,11,5,12],[3,5,4,5],[5,13,7,13],[5,14,7,14],[6,11,7,11],[6,12,7,12],[8,14,9,14],[10,14,11,14],[8,8,9,9],[8,10,9,10],[8,11,9,11],[8,12,9,12],[8,13,9,13],[10,8,11,9],[10,10,11,10],[10,11,11,11],[10,12,11,12],[10,13,11,13],[52,19,53,20],[54,19,55,20],[54,21,55,21],[54,22,55,22],[54,24,55,27],[58,19,58,20],[59,19,59,20],[44,19,45,20],[44,21,45,21],[44,24,45,27],[6,23,7,23],[8,19,9,20],[8,21,9,21],[8,22,9,22],[8,23,9,23],[8,24,9,24],[8,25,9,25],[16,19,17,20],[16,21,17,21],[16,22,17,22],[16,23,17,23],[16,24,17,24],[16,25,17,25],[5,24,7,24],[5,25,7,25],[6,22,7,22],[252,10,252,36],[3,6,4,6],[10,19,11,20],[10,21,11,21],[10,22,11,22],[10,23,11,23],[10,24,11,24],[10,25,11,25],[12,19,13,20],[12,21,13,21],[12,22,13,22],[12,23,13,23],[12,24,13,24],[12,25,13,25],[14,19,15,20],[14,21,15,21],[14,22,15,22],[14,23,15,23],[14,24,15,24],[14,25,15,25],[5,19,7,20],[5,21,7,21],[20,19,21,25],[5,22,5,23],[56,50,56,51],[57,50,57,51],[50,40,51,41],[52,40,53,41],[52,42,53,42],[52,43,53,43],[52,45,53,48],[56,40,56,41],[57,40,57,41],[50,50,51,51],[52,50,53,51],[64,19,65,19],[115,52,115,53],[115,50,115,51],[115,55,115,56],[115,57,115,58],[118,19,118,20],[118,21,118,22],[118,24,118,25],[118,26,118,27],[64,20,65,20],[64,21,65,21],[64,22,65,22],[64,23,65,23],[64,24,65,24],[64,25,65,25],[64,26,65,26],[64,27,65,27],[61,50,62,50],[61,51,62,51],[61,52,62,52],[61,53,62,53],[61,54,62,54],[61,55,62,55],[61,56,62,56],[61,57,62,57],[61,58,62,58]]}
[]
[]
[]
[null,null,"Distribution",null,"Status of \n1 Parameter","Status of \n2 Parameter","Result",null,null,null,null,null,null,null,null,null,null,null,null,null,null,null,null,null,null,null,null,null,null,null,null,null,null,null,null,null,null,null,null,null,null,null,null,null,null,null,null,null,null,null,null,null,null,null,null,null,null,null,null,null,null,null,"Distribution","I-UEL or 99,865","I-LEL \nor 0,135","MR-UEL",null,null,null,null,null,null,null,null,null,null,null,null,null,null,null,null,null,null,null,null,null,null,null,null,null,null,null,null,null,null,null,null,null,null,null,null,null,null,null,null,null,null,null,null,null,null,null,null,null,null,null,null,null,null,null,"Number of pieces","Cm","Cmk"]
[null,null,null,null,null,null,null,null,null,null,null,null,null,null,null,null,null,null,null,null,null,null,null,null,null,null,null,null,null,null,null,null,null,null,null,null,null,null,null,null,null,null,null,null,null,null,null,null,null,null,null,null,null,null,null,null,null,null,null,null,null,null,null,null,null,null,null,null,null,null,null,null,null,null,null,null,null,null,null,null,null,null,null,null,null,null,null,null,null,null,null,null,null,null,null,null,null,null,null,null,null,null,null,null,null,null,null,null,null,null,null,null,null,null,null,null,null,null,null,null,null,50,{"$f":"IF(DT16=\"custom\",1.67,2)","v":2},1.67]
[null,"Normal","Normal",null,"Active","Inactive",{"$f":"IF(Visualization!F51=\"\",\"\",IF(IF(Values!$E$4=\"1 Parameter\",Calculation!E6,Calculation!F6)=\"Active\",Q13,\"\"))","v":""},null,"Tests",null,"Evaluation factor","Requested to use",null,"Normel distribution is proved","Result (number)",null,null,null,null,"Tests",null,"Evaluation factor","Requested to use",null,"Normel distribution is proved","Result (number)",null,null,null,null,"Tests",null,"Evaluation factor","Requested to use",null,"Normel distribution is proved","Result (number)",null,null,null,"Tests",null,"Evaluation factor","Requested to use",null,"Normel distribution is proved","Result (number)",null,null,null,"Tests",null,"Evaluation factor","Requested to use",null,"Normel distribution is proved","Result (number)",null,null,null,null,null,"Normal",{"$f":"BT17","v":""},{"$f":"BT18","v":""},{"$f":"BQ17","v":""},null,"I - Bar",{"$f":"IF(DA8=\"\",\"\",AVERAGE(DA8:DA57))","v":""},null,"MR - Bar",{"$f":"IF(BQ6=\"\",\"\",AVERAGE(DD9:DD57))","v":""},null,"I - Bar",{"$f":"BZ42","v":""},null,"MR - Bar",{"$f":"BT6","v":""},null,"I - Bar",{"$f":"CO6","v":""},null,"MR - Bar",{"$f":"BZ6","v":""},null,"I - Bar",{"$f":"IFERROR(AVERAGE(DB8:DB57),\"\")","v":""},null,"MR - Bar",{"$f":"IF(CI6=\"\",\"\",AVERAGE(DE9:DE57))","v":""},null,"I - Bar",{"$f":"CR42","v":""},null,"MR - Bar",{"$f":"BT6","v":""},null,"I - Bar",{"$f":"BQ6","v":""},null,"MR - Bar",{"$f":"BT6","v":""},null,"Nr.","I - Values","LN(I - Values)",null,"MR -\nValues","LN(MR -\nValues)","I - Average","MR - Average","Angle","Specification",null,"USL","LSL",{"$f":"IF(OR(Result_Distribution_1178=\"Normal\",Result_Distribution_1178=\"Lognormal\"),\"I-UEL\",IF(Result_Distribution_1178=\"Unkown\",\"\",\"99.865%\"))","v":"99.865%"},{"$f":"IF(OR(Result_Distribution_1178=\"Normal\",Result_Distribution_1178=\"Lognormal\"),\"I-LEL\",IF(Result_Distribution_1178=\"Unkown\",\"\",\"0.135%\"))","v":"0.135%"},{"$f":"IF(Result_Distribution_1178=\"Normal\",\"MR-UEL\",IF(Result_Distribution_1178=\"Lognormal\",\"MR-UEL\",IF(Result_Distribution_1178=\"Tunc-Normal\",\"\",IF(Result_Distribution_1178=\"Rayleigh\",\"\",IF(Result_Distribution_1178=\"Weibull\",\"\",\"\")))))","v":""},"Setpoint",null,{"$f":"IF(DT16=\"custom\",40,45)","v":45},{"$f":"IF(DT16=\"custom\",1.74,2.02)","v":2.02},{"$f":"IF(DT16=\"custom\",1.74,1.69)","v":1.69},null,null,null,null,null,null,null,null,null,null,null,null,null,null,null,null,null,null,null,"Classes","Values per class",null,"Number of values per class [%]","Number of values per class [%] (accumulated)","USL","LSL","Amount of classes","Set Point",null,"Y- Values","Expected",null,"Y- Values",null,"Y- Values",null,"Y- Values",null,"Y- Values",null,"Y- Values"]
[null,"Rayleigh 2P","Rayleigh",null,"Inactive","Active",{"$f":"IF(Visualization!F51=\"\",\"\",IF(IF(Values!$E$4=\"1 Parameter\",Calculation!E7,Calculation!F7)=\"Active\",AB13,\"\"))","v":""},null,null,null,null,"System (Secondary)","User (Primary)",null,null,null,null,null,null,null,null,null,"System (Secondary)","User (Primary)",null,null,null,null,null,null,null,null,null,"System (Secondary)","User (Primary)",null,null,null,null,null,null,null,null,"System (Secondary)","User (Primary)",null,null,null,null,null,null,null,null,"System (Secondary)","User (Primary)",null,null,null,null,null,null,null,"Rayleigh",{"$f":"BY36","v":""},{"$f":"BY34","v":""},"-",null,"I-Median",{"$f":"IF(DA8=\"\",\"\",MEDIAN(DA8:DA57))","v":""},null,"MR sigma",{"$f":"IF(BQ6=\"\",\"\",BT6/BS12)","v":""},null,"I-Median",{"$f":"BQ7","v":""},null,null,null,null,"I-Median",{"$f":"CO7","v":""},null,null,null,null,"I-Median",{"$f":"IFERROR(MEDIAN(DB8:DB57),\"\")","v":""},null,"MR sigma",{"$f":"IF(CI6=\"\",\"\",CL6/CK12)","v":""},null,"I-Median",{"$f":"BQ7","v":""},null,null,null,null,"I-Median",{"$f":"BQ7","v":""},null,null,null,null,null,null,null,null,null,null,null,null,null,"X","Y",null,null,null,null,null,null,null,{"$f":"IF(DT16=\"custom\",30,40)","v":40},{"$f":"IF(DT16=\"custom\",1.78,2.05)","v":2.0499999999999998},{"$f":"IF(DT16=\"custom\",1.78,1.72)","v":1.72},null,null,null,null,null,null,null,null,null,null,null,null,null,null,null,null,null,null,null,null,null,null,null,null,null,null,null,null,null,{"$f":"IF(DA8=\"\",\"\",NORMDIST($EN8,$BQ$6,$DW$14,0))","v":""},{"$f":"IF(EO8=\"\",\"\",NORMDIST($EN8,$BQ$6,$DW$14,1)*100)","v":""},null,null,null,null,null,null,null,{"$f":"IF(DA8=\"\",\"\",IFERROR(IF(EN8<=0,#N/A,((EXP(-((((EN8-$EC$28)/$EC$29)^2)/2))+EXP(-((((EN8+$EC$28)/$EC$29)^2)/2)))/($EC$29*SQRT(2*PI())))),#N/A))","v":""},null,{"$f":"IF(DA8=\"\",\"\",IF(EQ8=\"\",0,IF(EQ8=0,0,EQ8+3)))","v":""}]
[null,"Rayleigh 3P","Trunc-Normal",null,"Active","Inactive",{"$f":"IF(BQ6=\"\",\"\",IF(BQ6-3*DW14>0,\"NG\",IF(Visualization!F51=\"\",\"\",IF(IF(Values!$E$4=\"1 Parameter\",Calculation!E8,Calculation!F8)=\"Active\",AW13,\"\"))))","v":""},null,null,null,null,null,null,null,null,null,null,null,null,null,null,null,null,null,null,null,null,null,null,null,null,null,null,null,null,null,null,null,null,null,null,null,null,null,null,null,null,null,null,null,null,null,null,null,null,null,null,null,null,null,null,null,"Trunc-Normal",{"$f":"CE34","v":""},{"$f":"CE36","v":""},"-",null,null,null,null,null,null,null,null,null,null,null,null,null,null,null,null,null,null,null,null,null,null,null,null,null,null,null,null,null,null,null,null,null,null,null,null,null,{"$f":"IF(Values!C13=\"\",\"\",1)","v":""},{"$f":"IF(AND(Values!D13=\"\",Values!E13=\"\"),\"\",IF(Values!$E$4=\"1 Parameter\",Values!D13,SQRT(Values!D13^2+Values!E13^2)))","v":""},{"$f":"IF(DA8=\"\",\"\",LN(DA8))","v":""},null,{"$f":"IF(DA8=\"\",\"\",0)","v":""},{"$f":"IF(DA8=\"\",\"\",0)","v":""},{"$f":"IF(DA8=\"\",\"\",AVERAGE($DA$8:$DA$57))","v":""},{"$f":"IF(DD8=\"\",\"\",AVERAGE($DD$8:$DD$57))","v":""},0,{"$f":"SIN(RADIANS(DH8))*Visualization!$L$20+0","v":0},{"$f":"COS(RADIANS(DH8))*Visualization!$L$20","v":0},{"$f":"IF(DA8=\"\",\"\",_xlfn.NUMBERVALUE(Visualization!$L$20))","v":""},{"$f":"IF(DA8=\"\",\"\",_xlfn.NUMBERVALUE(Visualization!$L$21))","v":""},{"$f":"IFERROR(IF(VLOOKUP(Result_Distribution_1178,Calculation!BK6:BN10,2,FALSE)=\"-\",NA(),VLOOKUP(Result_Distribution_1178,Calculation!BK6:BN10,2,FALSE)),\"\")","v":""},{"$f":"IFERROR(IF(VLOOKUP(Result_Distribution_1178,Calculation!BK6:BN10,3,FALSE)=\"-\",NA(),VLOOKUP(Result_Distribution_1178,Calculation!BK6:BN10,3,FALSE)),\"\")","v":""},{"$f":"IFERROR(IF(VLOOKUP(Result_Distribution_1178,Calculation!BK6:BN10,4,FALSE)=\"-\",NA(),VLOOKUP(Result_Distribution_1178,Calculation!BK6:BN10,4,FALSE)),\"\")","v":""},{"$f":"IF(Visualization!$F$21=\"\",\"\",IF(DA8=\"\",\"\",_xlfn.NUMBERVALUE(Visualization!$F$21)))","v":""},null,{"$f":"IF(DT16=\"custom\",20,35)","v":35},{"$f":"IF(DT16=\"custom\",1.91,2.08)","v":2.08},{"$f":"IF(DT16=\"custom\",1.91,1.75)","v":1.75},null,"Number of values:",{"$f":"IF(DA8=\"\",\"\",COUNT(DA8:DA57))","v":""},null,"Number of values:",{"$f":"DW8","v":""},null,"Number of values:",{"$f":"DZ8","v":""},null,"Number of values:",{"$f":"EC8","v":""},null,"Number of values:",{"$f":"EF8","v":""},null,"Number of values:",{"$f":"EI8","v":""},null,{"$f":"IF(DA8=\"\",\"\",IF($DW$8<15,\"\",DW10-2*DW13))","v":""},{"$f":"IF(EN8=\"\",\"\",IF(OR(COUNT($DA$8:$DA$57)=EO6,EO6=\"\"),\"\",FREQUENCY($DA$8:$DA$57,EN8)))","v":""},{"$f":"EO8","v":""},{"$f":"IF(EP8=\"\",\"\",(100/(SUM($EP$8:$EP$27))*EP8))","v":""},{"$f":"IF(EP8=\"\",\"\",EQ8)","v":""},{"$f":"IF(ER8=\"\",\"\",_xlfn.NUMBERVALUE(Visualization!$L$20))","v":""},{"$f":"IF(ER8=\"\",\"\",_xlfn.NUMBERVALUE(Visualization!$L$21))","v":""},{"$f":"IF(EO8=\"\",\"\",MAX($EQ$8:$EQ$27))","v":""},{"$f":"IF(EU8=\"\",\"\",IF(Visualization!$F$21=\"\",0,Visualization!$F$21))","v":""},null,{"$f":"IF($DA$8=\"\",\"\",NORMDIST($EN9,$BQ$6,$DW$14,0))","v":""},{"$f":"IF(EO8=\"\",\"\",NORMDIST($EN9,$BQ$6,$DW$14,1)*100)","v":""},null,{"$f":"IF(DA8=\"\",\"\",IFERROR(_xlfn.WEIBULL.DIST(EN8,2,$CR$45,FALSE),\"#N/A\"))","v":""},null,{"$f":"IF(DA8=\"\",\"\",IFERROR(IF(EN8<0,NA(),_xlfn.LOGNORM.DIST(EN8,LN($BQ$6),LN($DW$14),FALSE)),NA()))","v":""},null,{"$f":"IF(DA8=\"\",\"\",_xlfn.WEIBULL.DIST(IF(EN8<0,NA(),EN8),$CR$44,$CR$45,FALSE))","v":""},null,{"$f":"IF($DA$8=\"\",\"\",IFERROR(IF(EN9<=0,#N/A,((EXP(-((((EN9-$EC$28)/$EC$29)^2)/2))+EXP(-((((EN9+$EC$28)/$EC$29)^2)/2)))/($EC$29*SQRT(2*PI())))),#N/A))","v":""},null,{"$f":"IF($DA$8=\"\",\"\",IF(EQ9=\"\",0,IF(EQ9=0,0,EQ9+3)))","v":""}]
[null,"Truncated","Log-Normal",null,"Inactive","Inactive",{"$f":"IF(Visualization!F51=\"\",\"\",IF(IF(Values!$E$4=\"1 Parameter\",Calculation!E9,Calculation!F9)=\"Active\",AM13,\"\"))","v":""},null,"Anderson Darling",null,1,{"$f":"IF(DW8>5,\"OK\",\"NG\")","v":"OK"},"Unvalued",{"$f":"IF(BQ6=\"\",\"\",IF(MAX(M109:M112)>I114,\"OK\",\"NG\"))","v":""},{"$f":"IF(N9=\"\",0,IF(OR(L9=\"NG\",M9=\"Not utilized\"),0,IF(N9=\"OK\",1,-1)))","v":0},null,null,null,null,"Anderson Darling",null,1,{"$f":"IF(ET6>5,\"OK\",\"NG\")","v":"OK"},"Unvalued",{"$f":"IF(CT6=\"\",\"\",IF(MAX(AA119)<V119,\"OK\",\"NG\"))","v":{"$error":"#VALUE!"}},{"$f":"IF(Y9=\"\",0,IF(OR(W9=\"NG\",X9=\"Not utilized\"),0,IF(Y9=\"OK\",1,-1)))","v":{"$error":"#VALUE!"}},null,null,null,null,"Anderson Darling",null,1,{"$f":"IF(ET6>5,\"OK\",\"NG\")","v":"OK"},"Unvalued",{"$f":"IF(DD6=\"\",\"\",IF(MAX(AI109:AI112)>AE114,\"OK\",\"NG\"))","v":"NG"},{"$f":"IF(AJ9=\"\",0,IF(OR(AH9=\"NG\",AI9=\"Not utilized\"),0,IF(AJ9=\"OK\",1,-1)))","v":-1},null,null,null,null,null,null,null,null,null,null,null,null,null,"Anderson Darling",null,1,{"$f":"IF(DW8>5,\"OK\",\"NG\")","v":"OK"},"Unvalued",{"$f":"IF(BB9=\"\",\"\",IF(MAX(BF116)<BA116,\"OK\",\"NG\"))","v":{"$error":"#VALUE!"}},{"$f":"IF(BD9=\"\",0,IF(OR(BB9=\"NG\",BC9=\"Not utilized\"),0,IF(BD9=\"OK\",1,-1)))","v":{"$error":"#VALUE!"}},null,null,null,null,null,"Lognormal",{"$f":"BL6","v":""},"-",{"$f":"CI17","v":""},null,null,null,null,null,null,null,null,null,null,null,null,null,null,null,null,null,null,null,null,null,null,null,null,null,null,null,null,null,null,null,null,null,null,null,null,null,{"$f":"IF(Values!C14=\"\",\"\",CZ8+1)","v":""},{"$f":"IF(AND(Values!D14=\"\",Values!E14=\"\"),\"\",IF(Values!$E$4=\"1 Parameter\",Values!D14,SQRT(Values!D14^2+Values!E14^2)))","v":""},{"$f":"IF(DA9=\"\",\"\",LN(DA9))","v":""},null,{"$f":"IF(DA9=\"\",\"\",MAX(DA8:DA9)-MIN(DA8:DA9))","v":""},{"$f":"IF(DB9=\"\",\"\",MAX(DB8:DB9)-MIN(DB8:DB9))","v":""},{"$f":"IF(DA9=\"\",\"\",IF($DF$8=\"\",\"\",$DF$8))","v":""},{"$f":"IF(DA9=\"\",\"\",IF($DG$8=\"\",\"\",$DG$8))","v":""},{"$f":"IF(DA8=\"\",\"\",360/$DZ$8)","v":""},{"$f":"IF(DA8=\"\",\"\",SIN(RADIANS(DH9))*Visualization!$L$20+0)","v":""},{"$f":"IF(DA8=\"\",\"\",COS(RADIANS(DH9))*Visualization!$L$20)","v":""},{"$f":"IF(DA9=\"\",\"\",_xlfn.NUMBERVALUE(Visualization!$L$20))","v":""},{"$f":"IF(DA9=\"\",\"\",_xlfn.NUMBERVALUE(Visualization!$L$21))","v":""},{"$f":"$DM$8","v":""},{"$f":"$DN$8","v":""},{"$f":"$DO$8","v":""},{"$f":"IF(Visualization!$F$21=\"\",\"\",IF(DA9=\"\",\"\",_xlfn.NUMBERVALUE(Visualization!$F$21)))","v":""},null,{"$f":"IF(DT16=\"custom\",15,30)","v":30},{"$f":"IF(DT16=\"custom\",2.03,2.13)","v":2.13},{"$f":"IF(DT16=\"custom\",2.03,1.79)","v":1.79},null,"Max value",{"$f":"IF(DA8=\"\",\"\",MAX(DA8:DA57))","v":""},null,"Max value",{"$f":"DW9","v":""},null,"Max value",{"$f":"DW9","v":""},null,"Max value",{"$f":"IF(DA8=\"\",\"\",MAX(DB8:DB57))","v":""},null,"Max value",{"$f":"DW9","v":""},null,"Max value","",null,{"$f":"IF($DA$8=\"\",\"\",EN8+$DW$13)","v":""},{"$f":"IF(EN9=\"\",\"\",IF(OR(COUNT($DA$8:$DA$57)=EO8,EO8=\"\"),\"\",FREQUENCY($DA$8:$DA$57,EN9)))","v":""},{"$f":"IF(EO9=\"\",\"\",EO9-EO8)","v":""},"",{"$f":"IF(EP9=\"\",\"\",ER8+EQ9)","v":""},{"$f":"IF(ER9=\"\",\"\",_xlfn.NUMBERVALUE(Visualization!$L$20))","v":""},{"$f":"IF(ER9=\"\",\"\",_xlfn.NUMBERVALUE(Visualization!$L$21))","v":""},"",{"$f":"IF(EU9=\"\",\"\",IF(Visualization!$F$21=\"\",0,Visualization!$F$21))","v":""},null,{"$f":"IF($DA$8=\"\",\"\",NORMDIST($EN10,$BQ$6,$DW$14,0))","v":""},{"$f":"IF(EO10=\"\",\"\",NORMDIST($EN10,$BQ$6,$DW$14,1)*100)","v":""},null,{"$f":"IF($DA$8=\"\",\"\",IFERROR(_xlfn.WEIBULL.DIST(EN9,2,$CR$45,FALSE),\"#N/A\"))","v":""},null,{"$f":"IF($DA$8=\"\",\"\",IFERROR(IF(EN9<0,NA(),_xlfn.LOGNORM.DIST(EN9,LN($BQ$6),LN($DW$14),FALSE)),NA()))","v":""},null,{"$f":"IF($DA$8=\"\",\"\",_xlfn.WEIBULL.DIST(IF(EN9<0,NA(),EN9),$CR$44,$CR$45,FALSE))","v":""},null,{"$f":"IF($DA$8=\"\",\"\",IFERROR(IF(EN10<=0,#N/A,((EXP(-((((EN10-$EC$28)/$EC$29)^2)/2))+EXP(-((((EN10+$EC$28)/$EC$29)^2)/2)))/($EC$29*SQRT(2*PI())))),#N/A))","v":""},null,{"$f":"IF($DA$8=\"\",\"\",IF(EQ10=\"\",0,IF(EQ10=0,0,EQ10+3)))","v":""}]
[null,"Log-Normal 2P","Weibull",null,"Inactive","Inactive",{"$f":"IF(Visualization!F51=\"\",\"\",IF(IF(Values!$E$4=\"1 Parameter\",Calculation!E10,Calculation!F10)=\"Active\",BG13,\"\"))","v":""},null,null,null,null,null,null,null,null,null,null,null,null,null,null,null,null,null,null,null,null,null,null,null,null,null,null,null,null,null,null,null,null,null,null,null,null,null,null,null,null,null,null,null,null,null,null,null,null,null,null,null,null,null,null,null,"Weibull",{"$f":"CQ36","v":""},{"$f":"CQ34","v":""},"-",null,null,null,null,null,null,null,null,null,null,null,null,null,null,null,null,null,null,null,null,null,null,null,null,null,null,null,null,null,null,null,null,null,null,null,null,null,{"$f":"IF(Values!C15=\"\",\"\",CZ9+1)","v":""},{"$f":"IF(AND(Values!D15=\"\",Values!E15=\"\"),\"\",IF(Values!$E$4=\"1 Parameter\",Values!D15,SQRT(Values!D15^2+Values!E15^2)))","v":""},"",null,"",{"$f":"IF(DB10=\"\",\"\",MAX(DB9:DB10)-MIN(DB9:DB10))","v":""},{"$f":"IF(DA10=\"\",\"\",IF($DF$8=\"\",\"\",$DF$8))","v":""},{"$f":"IF(DA10=\"\",\"\",IF($DG$8=\"\",\"\",$DG$8))","v":""},{"$f":"IF($DA$8=\"\",\"\",360/$DZ$8+DH9)","v":""},{"$f":"IF($DA$8=\"\",\"\",SIN(RADIANS(DH10))*Visualization!$L$20+0)","v":""},{"$f":"IF($DA$8=\"\",\"\",COS(RADIANS(DH10))*Visualization!$L$20)","v":""},{"$f":"IF(DA10=\"\",\"\",_xlfn.NUMBERVALUE(Visualization!$L$20))","v":""},{"$f":"IF(DA10=\"\",\"\",_xlfn.NUMBERVALUE(Visualization!$L$21))","v":""},{"$f":"$DM$8","v":""},{"$f":"$DN$8","v":""},{"$f":"$DO$8","v":""},{"$f":"IF(Visualization!$F$21=\"\",\"\",IF(DA10=\"\",\"\",_xlfn.NUMBERVALUE(Visualization!$F$21)))","v":""},null,{"$f":"IF(DT16=\"custom\",\"\",25)","v":25},{"$f":"IF(DT16=\"custom\",\"\",2.19)","v":2.19},{"$f":"IF(DT16=\"custom\",\"\",1.85)","v":1.85},null,"Min value",{"$f":"IF(DA8=\"\",\"\",MIN(DA8:DA57))","v":""},null,"Min value",{"$f":"DW10","v":""},null,"Min value","",null,"Min value",{"$f":"IF(DA8=\"\",\"\",MIN(DB8:DB57))","v":""},null,"Min value",{"$f":"DW10","v":""},null,"Min value","",null,{"$f":"IF($DA$8=\"\",\"\",EN9+$DW$13)","v":""},{"$f":"IF(EN10=\"\",\"\",IF(OR(COUNT($DA$8:$DA$57)=EO9,EO9=\"\"),\"\",FREQUENCY($DA$8:$DA$57,EN10)))","v":""},"","","",{"$f":"IF(ER10=\"\",\"\",_xlfn.NUMBERVALUE(Visualization!$L$20))","v":""},{"$f":"IF(ER10=\"\",\"\",_xlfn.NUMBERVALUE(Visualization!$L$21))","v":""},"",{"$f":"IF(EU10=\"\",\"\",IF(Visualization!$F$21=\"\",0,Visualization!$F$21))","v":""},null,"","",null,{"$f":"IF($DA$8=\"\",\"\",IFERROR(_xlfn.WEIBULL.DIST(EN10,2,$CR$45,FALSE),\"#N/A\"))","v":""},null,{"$f":"IF($DA$8=\"\",\"\",IFERROR(IF(EN10<0,NA(),_xlfn.LOGNORM.DIST(EN10,LN($BQ$6),LN($DW$14),FALSE)),NA()))","v":""},null,{"$f":"IF($DA$8=\"\",\"\",_xlfn.WEIBULL.DIST(IF(EN10<0,NA(),EN10),$CR$44,$CR$45,FALSE))","v":""},null,"",null,""]
[null,"Log-Normal 3P","Unkown",null,"Inactive","Active",{"$f":"IF(Visualization!F51=\"\",\"\",IF(IF(Values!$E$4=\"1 Parameter\",Calculation!E11,Calculation!F11)=\"Inactive\",\"\",IF(COUNTIF(G6:G10,\"Approved\")=0,\"Approved\",\"NG\")))","v":""},null,"Chi square",null,1,{"$f":"IF(DW8>25,\"OK\",\"NG\")","v":"OK"},"Unvalued",{"$f":"IF(BQ6=\"\",\"\",IF(I124>=L124,\"OK\",\"NG\"))","v":""},{"$f":"IF(N11=\"\",0,IF(OR(L11=\"NG\",M11=\"Not utilized\"),0,IF(N11=\"OK\",1,-1)))","v":0},null,"Overall result",null,null,"Chi square",null,1,{"$f":"IF(DW8>25,\"OK\",\"NG\")","v":"OK"},"Unvalued",{"$f":"IF(T55<W55,\"OK\",\"NG\")","v":{"$error":"#VALUE!"}},{"$f":"IF(Y11=\"\",0,IF(OR(W11=\"NG\",X11=\"Not utilized\"),0,IF(Y11=\"OK\",1,-1)))","v":{"$error":"#VALUE!"}},null,"Overall result",null,null,null,null,null,null,null,null,null,null,"Overall result",null,"Chi square",null,1,{"$f":"IF(DW8>25,\"OK\",\"NG\")","v":"OK"},"Unvalued",{"$f":"IF(DA8=\"\",\"\",IF(AO53<AR53,\"OK\",\"NG\"))","v":""},{"$f":"IF(AT11=\"\",0,IF(OR(AR11=\"NG\",AS11=\"Not utilized\"),0,IF(AT11=\"OK\",1,-1)))","v":0},null,"Overall result",null,"Chi square",null,1,{"$f":"IF(DW8>25,\"OK\",\"NG\")","v":"OK"},"Unvalued",{"$f":"IF(DA8=\"\",\"\",IF(AY53<BB53,\"OK\",\"NG\"))","v":""},{"$f":"IF(BD11=\"\",0,IF(OR(BB11=\"NG\",BC11=\"Not utilized\"),0,IF(BD11=\"OK\",1,-1)))","v":0},null,"Overall result",null,null,null,null,null,null,null,null,null,null,"n","d2","d3",null,null,null,null,null,null,null,null,null,null,null,null,null,null,null,"n","d2","d3",null,null,null,null,null,null,null,null,null,null,null,null,null,{"$f":"IF(Values!C16=\"\",\"\",CZ10+1)","v":""},{"$f":"IF(AND(Values!D16=\"\",Values!E16=\"\"),\"\",IF(Values!$E$4=\"1 Parameter\",Values!D16,SQRT(Values!D16^2+Values!E16^2)))","v":""},"",null,"","","","",{"$f":"IF($DA$8=\"\",\"\",360/$DZ$8+DH10)","v":""},{"$f":"IF($DA$8=\"\",\"\",SIN(RADIANS(DH11))*Visualization!$L$20+0)","v":""},{"$f":"IF($DA$8=\"\",\"\",COS(RADIANS(DH11))*Visualization!$L$20)","v":""},{"$f":"IF(DA11=\"\",\"\",_xlfn.NUMBERVALUE(Visualization!$L$20))","v":""},{"$f":"IF(DA11=\"\",\"\",_xlfn.NUMBERVALUE(Visualization!$L$21))","v":""},{"$f":"$DM$8","v":""},"","",{"$f":"IF(Visualization!$F$21=\"\",\"\",IF(DA11=\"\",\"\",_xlfn.NUMBERVALUE(Visualization!$F$21)))","v":""},null,{"$f":"IF(DT16=\"custom\",\"\",20)","v":20},{"$f":"IF(DT16=\"custom\",\"\",2.28)","v":2.2799999999999998},{"$f":"IF(DT16=\"custom\",\"\",1.93)","v":1.93},null,"Range:",{"$f":"IF(DA8=\"\",\"\",DW9-DW10)","v":""},null,"Range:",{"$f":"IF(DF8=\"\",\"\",DZ9-DZ10)","v":""},null,"Range:","",null,"Range:",{"$f":"IF(EF9=\"\",\"\",EF9-EF10)","v":""},null,"Range:",{"$f":"DW11","v":""},null,"Range:","",null,"",{"$f":"IF(EN11=\"\",\"\",IF(OR(COUNT($DA$8:$DA$57)=EO10,EO10=\"\"),\"\",FREQUENCY($DA$8:$DA$57,EN11)))","v":""},"","","",{"$f":"IF(ER11=\"\",\"\",_xlfn.NUMBERVALUE(Visualization!$L$20))","v":""},{"$f":"IF(ER11=\"\",\"\",_xlfn.NUMBERVALUE(Visualization!$L$21))","v":""},"",{"$f":"IF(EU11=\"\",\"\",IF(Visualization!$F$21=\"\",0,Visualization!$F$21))","v":""},null,"","",null,"",null,"",null,"",null,"",null,""]
[null,"Weibull 2P",null,null,null,null,null,null,null,null,null,null,null,null,null,null,null,null,null,null,null,null,null,null,null,null,null,null,null,null,null,null,null,null,null,null,null,null,null,null,null,null,null,null,null,null,null,null,null,null,null,null,null,null,null,null,null,null,null,null,null,null,null,null,null,null,null,null,null,1,1.1279999999999999,null,null,null,null,null,null,null,null,null,null,null,null,null,null,null,null,1,1.1279999999999999,null,null,null,null,null,null,null,null,null,null,null,null,null,null,{"$f":"IF(Values!C17=\"\",\"\",CZ11+1)","v":""},{"$f":"IF(AND(Values!D17=\"\",Values!E17=\"\"),\"\",IF(Values!$E$4=\"1 Parameter\",Values!D17,SQRT(Values!D17^2+Values!E17^2)))","v":""},"",null,"","","","","",{"$f":"IF($DA$8=\"\",\"\",SIN(RADIANS(DH12))*Visualization!$L$20+0)","v":""},{"$f":"IF($DA$8=\"\",\"\",COS(RADIANS(DH12))*Visualization!$L$20)","v":""},{"$f":"IF(DA12=\"\",\"\",_xlfn.NUMBERVALUE(Visualization!$L$20))","v":""},{"$f":"IF(DA12=\"\",\"\",_xlfn.NUMBERVALUE(Visualization!$L$21))","v":""},"","","",{"$f":"IF(Visualization!$F$21=\"\",\"\",IF(DA12=\"\",\"\",_xlfn.NUMBERVALUE(Visualization!$F$21)))","v":""},null,null,null,null,null,"Number of classes: ",{"$f":"IF(DA8=\"\",\"\",IF(ROUNDUP(DW8^(1/2),0)>20,20,ROUNDUP(DW8^(1/2)+2,0)))","v":""},null,"Number of classes: ",{"$f":"IF(DF8=\"\",\"\",IF(ROUNDUP(DZ8^(1/2),0)>20,20,ROUNDUP(DZ8^(1/2)+2,0)))","v":""},null,"Number of classes: ","",null,"Number of classes: ",{"$f":"IF(EF9=\"\",\"\",IF(ROUNDUP(EF8^(1/2),0)>20,20,ROUNDUP(EF8^(1/2)+2,0)))","v":""},null,"Number of classes: ",{"$f":"EC12","v":""},null,"Number of classes: ","",null,"","","","","",{"$f":"IF(ER12=\"\",\"\",_xlfn.NUMBERVALUE(Visualization!$L$20))","v":""},{"$f":"IF(ER12=\"\",\"\",_xlfn.NUMBERVALUE(Visualization!$L$21))","v":""},"",{"$f":"IF(EU12=\"\",\"\",IF(Visualization!$F$21=\"\",0,Visualization!$F$21))","v":""},null,"","",null,"",null,"",null,"",null,"",null,""]
[null,"Weibull 3P",null,null,{"$f":"IF(Values!E4=\"2 Parameter\",\"\",IF(AND(G6=\"Approved\",E6=\"Active\"),\"Normal\",IF(AND(G9=\"Approved\",E9=\"Active\"),\"Lognormal\",IF(AND(G8=\"Approved\",E8=\"Active\"),\"Trunc-Normal\",IF(AND(G7=\"Approved\",E7=\"Active\"),\"Rayleight\",IF(AND(G10=\"Approved\",E10=\"Active\"),\"Weibull\",\"Unkown\"))))))","v":"Unkown"},{"$f":"IF(Values!E4=\"1 Parameter\",\"\",IF(AND(G6=\"Approved\",F6=\"Active\"),\"Normal\",IF(AND(G9=\"Approved\",F9=\"Active\"),\"Lognormal\",IF(AND(G8=\"Approved\",F8=\"Active\"),\"Trunc-Normal\",IF(AND(G7=\"Approved\",F7=\"Active\"),\"Rayleight\",IF(AND(G10=\"Approved\",F10=\"Active\"),\"Weibull\",\"Unkown\"))))))","v":""},null,null,"Kolmogorov Smirnov",null,1,{"$f":"IF(DW8>35,\"NG\",\"OK\")","v":"NG"},"Unvalued",{"$f":"IF(BQ6=\"\",\"\",IF(P176>P181,\"OK\",\"NG\"))","v":""},{"$f":"IF(N13=\"\",0,IF(OR(L13=\"NG\",M13=\"Not utilized\"),0,IF(N13=\"OK\",1,-1)))","v":0},null,{"$f":"IF(Visualization!F51=\"\",\"\",IF(COUNTIF(O9:O18,1)>COUNTIF(O9:O18,-1),\"Approved\",\"NG\"))","v":""},null,null,null,null,null,null,null,null,null,null,{"$f":"IF(Visualization!F51=\"\",\"\",IF(COUNTIF(Z9:Z18,1)>COUNTIF(Z9:Z18,-1),\"Approved\",\"NG\"))","v":""},null,null,"Kolmogorov Smirnov",null,1,{"$f":"IF(ET6>35,\"NG\",\"OK\")","v":"NG"},"Unvalued",{"$f":"IF(DD6=\"\",\"\",IF(AL163>AL168,\"OK\",\"NG\"))","v":"NG"},{"$f":"IF(AJ13=\"\",0,IF(OR(AH13=\"NG\",AI13=\"Not utilized\"),0,IF(AJ13=\"OK\",1,-1)))","v":0},null,{"$f":"IF(Visualization!F51=\"\",\"\",IF(Q13=\"Approved\",\"NG\",IF(COUNTIF(AK9:AK18,1)>COUNTIF(AK9:AK18,-1),\"Approved\",\"NG\")))","v":""},null,null,null,null,null,null,null,null,null,{"$f":"IF(Visualization!F51=\"\",\"\",IF(Q13=\"Approved\",\"NG\",IF(COUNTIF(AU9:AU18,1)>COUNTIF(AU9:AU18,-1),\"Approved\",\"NG\")))","v":""},null,null,null,null,null,null,null,null,null,{"$f":"IF(Visualization!F51=\"\",\"\",IF(COUNTIF(BE9:BE18,1)>COUNTIF(BE9:BE18,-1),\"Approved\",\"NG\"))","v":""},null,null,null,null,null,null,null,null,null,null,2,null,0.85250000000000004,null,null,null,null,null,null,null,null,null,null,null,null,null,null,null,2,null,0.85250000000000004,null,null,null,null,null,null,null,null,null,null,null,null,null,{"$f":"IF(Values!C18=\"\",\"\",CZ12+1)","v":""},{"$f":"IF(AND(Values!D18=\"\",Values!E18=\"\"),\"\",IF(Values!$E$4=\"1 Parameter\",Values!D18,SQRT(Values!D18^2+Values!E18^2)))","v":""},"",null,"","","","","",{"$f":"IF($DA$8=\"\",\"\",SIN(RADIANS(DH13))*Visualization!$L$20+0)","v":""},{"$f":"IF($DA$8=\"\",\"\",COS(RADIANS(DH13))*Visualization!$L$20)","v":""},{"$f":"IF(DA13=\"\",\"\",_xlfn.NUMBERVALUE(Visualization!$L$20))","v":""},{"$f":"IF(DA13=\"\",\"\",_xlfn.NUMBERVALUE(Visualization!$L$21))","v":""},"","","",{"$f":"IF(Visualization!$F$21=\"\",\"\",IF(DA13=\"\",\"\",_xlfn.NUMBERVALUE(Visualization!$F$21)))","v":""},null,null,null,null,"2.00/1.67","Width of classes:",{"$f":"IF(DA8=\"\",\"\",DW11/(DW12-3))","v":""},null,"Width of classes:",{"$f":"IF(DF8=\"\",\"\",DZ11/(DZ12-3))","v":""},null,"Width of classes:","",null,"Width of classes:",{"$f":"IF(EF9=\"\",\"\",EF11/(EF12-3))","v":""},null,"Width of classes:",{"$f":"EC13","v":""},null,"Width of classes:","",null,"","","","","",{"$f":"IF(ER13=\"\",\"\",_xlfn.NUMBERVALUE(Visualization!$L$20))","v":""},{"$f":"IF(ER13=\"\",\"\",_xlfn.NUMBERVALUE(Visualization!$L$21))","v":""},"",{"$f":"IF(EU13=\"\",\"\",IF(Visualization!$F$21=\"\",0,Visualization!$F$21))","v":""},null,"","",null,"",null,"",null,"",null,"",null,""]
[null,"Unkown",null,null,null,null,null,null,null,null,null,null,null,null,null,null,null,null,null,null,null,null,null,null,null,null,null,null,null,null,null,null,null,null,null,null,null,null,null,null,null,null,null,null,null,null,null,null,null,null,null,null,null,null,null,null,null,null,null,null,null,null,null,null,null,null,null,null,null,null,null,null,null,null,null,null,null,null,null,null,null,null,null,null,null,null,null,null,null,null,null,null,null,null,null,null,null,null,null,null,null,null,null,{"$f":"IF(Values!C19=\"\",\"\",CZ13+1)","v":""},{"$f":"IF(AND(Values!D19=\"\",Values!E19=\"\"),\"\",IF(Values!$E$4=\"1 Parameter\",Values!D19,SQRT(Values!D19^2+Values!E19^2)))","v":""},"",null,"","","","","",{"$f":"IF($DA$8=\"\",\"\",SIN(RADIANS(DH14))*Visualization!$L$20+0)","v":""},{"$f":"IF($DA$8=\"\",\"\",COS(RADIANS(DH14))*Visualization!$L$20)","v":""},{"$f":"IF(DA14=\"\",\"\",_xlfn.NUMBERVALUE(Visualization!$L$20))","v":""},{"$f":"IF(DA14=\"\",\"\",_xlfn.NUMBERVALUE(Visualization!$L$21))","v":""},"","","",{"$f":"IF(Visualization!$F$21=\"\",\"\",IF(DA14=\"\",\"\",_xlfn.NUMBERVALUE(Visualization!$F$21)))","v":""},null,null,null,null,"1.67/1.67","Sigma",{"$f":"IFERROR(_xlfn.STDEV.S(DA8:DA57),\"\")","v":""},null,"Sigma",{"$f":"DW14","v":""},null,"σt","",null,"Sigma",{"$f":"IF(DA8=\"\",\"\",_xlfn.STDEV.S(DB8:DB57))","v":""},null,null,null,null,"Sigma",{"$f":"EC14","v":""},null,"","","","","",{"$f":"IF(ER14=\"\",\"\",_xlfn.NUMBERVALUE(Visualization!$L$20))","v":""},{"$f":"IF(ER14=\"\",\"\",_xlfn.NUMBERVALUE(Visualization!$L$21))","v":""},"",{"$f":"IF(EU14=\"\",\"\",IF(Visualization!$F$21=\"\",0,Visualization!$F$21))","v":""},null,"","",null,"",null,"",null,"",null,"",null,""]
[null,null,null,null,null,null,null,null,"Shapirov Wilks",null,1,{"$f":"IF(DW8>5,\"OK\",\"NG\")","v":"OK"},"Unvalued",{"$f":"IF(BQ6=\"\",\"\",IF(N244>N238,\"NG\",\"OK\"))","v":""},{"$f":"IF(N15=\"\",0,IF(OR(L15=\"NG\",M15=\"Not utilized\"),0,IF(N15=\"OK\",1,-1)))","v":0},null,null,null,null,null,null,null,null,null,null,null,null,null,null,null,"Shapirov Wilks",null,1,"OK","Unvalued",{"$f":"IF(DD6=\"\",\"\",IF(AJ231>AJ225,\"NG\",\"OK\"))","v":"OK"},{"$f":"IF(AJ15=\"\",0,IF(OR(AH15=\"NG\",AI15=\"Not utilized\"),0,IF(AJ15=\"OK\",1,-1)))","v":1},null,null,null,null,null,null,null,null,null,null,null,null,null,null,null,null,null,null,null,null,null,null,null,null,null,null,null,null,null,null,null,null,null,null,null,null,null,null,null,null,null,null,null,null,null,null,null,null,null,null,null,null,null,null,null,null,null,null,null,null,null,null,null,null,null,null,{"$f":"IF(Values!C20=\"\",\"\",CZ14+1)","v":""},{"$f":"IF(AND(Values!D20=\"\",Values!E20=\"\"),\"\",IF(Values!$E$4=\"1 Parameter\",Values!D20,SQRT(Values!D20^2+Values!E20^2)))","v":""},"",null,"","","","","",{"$f":"IF($DA$8=\"\",\"\",SIN(RADIANS(DH15))*Visualization!$L$20+0)","v":""},{"$f":"IF($DA$8=\"\",\"\",COS(RADIANS(DH15))*Visualization!$L$20)","v":""},{"$f":"IF(DA15=\"\",\"\",_xlfn.NUMBERVALUE(Visualization!$L$20))","v":""},{"$f":"IF(DA15=\"\",\"\",_xlfn.NUMBERVALUE(Visualization!$L$21))","v":""},"","","",{"$f":"IF(Visualization!$F$21=\"\",\"\",IF(DA15=\"\",\"\",_xlfn.NUMBERVALUE(Visualization!$F$21)))","v":""},null,null,null,null,null,null,null,null,null,null,null,null,null,null,null,null,null,null,null,null,null,null,null,"","","","","",{"$f":"IF(ER15=\"\",\"\",_xlfn.NUMBERVALUE(Visualization!$L$20))","v":""},{"$f":"IF(ER15=\"\",\"\",_xlfn.NUMBERVALUE(Visualization!$L$21))","v":""},"",{"$f":"IF(EU15=\"\",\"\",IF(Visualization!$F$21=\"\",0,Visualization!$F$21))","v":""},null,"","",null,"",null,"",null,"",null,"",null,""]
[null,null,null,null,null,null,null,null,null,null,null,null,null,null,null,null,null,null,null,null,null,null,null,null,null,null,null,null,null,null,null,null,null,null,null,null,null,null,null,null,null,null,null,null,null,null,null,null,null,null,null,null,null,null,null,null,null,null,null,null,null,null,null,null,null,null,null,"Limits",null,null,"Limits",null,null,null,null,null,null,null,null,null,null,null,null,null,null,"Limits",null,null,"Limits",null,null,null,null,null,null,null,null,null,null,null,null,null,null,{"$f":"IF(Values!C21=\"\",\"\",CZ15+1)","v":""},{"$f":"IF(AND(Values!D21=\"\",Values!E21=\"\"),\"\",IF(Values!$E$4=\"1 Parameter\",Values!D21,SQRT(Values!D21^2+Values!E21^2)))","v":""},"",null,"","","","","",{"$f":"IF($DA$8=\"\",\"\",SIN(RADIANS(DH16))*Visualization!$L$20+0)","v":""},{"$f":"IF($DA$8=\"\",\"\",COS(RADIANS(DH16))*Visualization!$L$20)","v":""},{"$f":"IF(DA16=\"\",\"\",_xlfn.NUMBERVALUE(Visualization!$L$20))","v":""},{"$f":"IF(DA16=\"\",\"\",_xlfn.NUMBERVALUE(Visualization!$L$21))","v":""},"","","",{"$f":"IF(Visualization!$F$21=\"\",\"\",IF(DA16=\"\",\"\",_xlfn.NUMBERVALUE(Visualization!$F$21)))","v":""},null,{"$f":"IF(Values!E5=\"No\",\"Pp; Ppk\",\"Cm; Cmk\")","v":"Cm; Cmk"},"2.00/1.67",{"$f":"IF(DS16=\"2.00/1.67\",\"MTCE standard\",\"custom\")","v":"MTCE standard"},null,null,null,null,null,null,null,null,null,null,null,null,null,null,null,null,null,null,null,"","","","","",{"$f":"IF(ER16=\"\",\"\",_xlfn.NUMBERVALUE(Visualization!$L$20))","v":""},{"$f":"IF(ER16=\"\",\"\",_xlfn.NUMBERVALUE(Visualization!$L$21))","v":""},"",{"$f":"IF(EU16=\"\",\"\",IF(Visualization!$F$21=\"\",0,Visualization!$F$21))","v":""},null,"","",null,"",null,"",null,"",null,"",null,""]
[null,null,null,null,null,null,null,null,"Graphic test",null,1,null,null,{"$f":"IF(K45=\"Unvalued\",\"\",IF(K45=\"Yes\",\"OK\",\"NG\"))","v":""},{"$f":"IF(N17=\"\",\"\",IF(N17=\"OK\",1,-1))","v":""},null,null,null,null,"Graphic test",null,1,null,null,{"$f":"IF(V45=\"Unvalued\",\"\",IF(V45=\"Yes\",\"OK\",\"NG\"))","v":""},{"$f":"IF(Y17=\"\",\"\",IF(Y17=\"OK\",1,-1))","v":""},null,null,null,null,"Graphic test",null,1,null,null,{"$f":"IF(AG45=\"Unvalued\",\"\",IF(AG45=\"Yes\",\"OK\",\"NG\"))","v":""},{"$f":"IF(AJ17=\"\",\"\",IF(AJ17=\"OK\",1,-1))","v":""},null,null,null,"Graphic test",null,1,null,null,{"$f":"IF(AQ45=\"Unvalued\",\"\",IF(AQ45=\"Yes\",\"OK\",\"NG\"))","v":""},{"$f":"IF(AT17=\"\",\"\",IF(AT17=\"OK\",1,-1))","v":""},null,null,null,"Graphic test",null,1,null,null,{"$f":"IF(BA45=\"Unvalued\",\"\",IF(BA45=\"Yes\",\"OK\",\"NG\"))","v":""},{"$f":"IF(BD17=\"\",\"\",IF(BD17=\"OK\",1,-1))","v":""},null,null,null,null,null,null,null,null,null,null,"MR - UEL",{"$f":"IF(BQ6=\"\",\"\",BS12*BT7+3*BT13*BT7)","v":""},null,"I - UEL",{"$f":"IF(BQ6=\"\",\"\",$BQ$6+(3*$BT$6)/BS12)","v":""},null,null,null,null,null,null,null,null,null,null,null,null,null,"MR - UEL",{"$f":"BQ17","v":""},null,"I - UEL",{"$f":"(IF(CI6=\"\",\"\",BQ6+EXP((3*$CL$6)/CK12)))","v":""},null,null,null,null,null,null,null,null,null,null,null,null,null,{"$f":"IF(Values!C22=\"\",\"\",CZ16+1)","v":""},{"$f":"IF(AND(Values!D22=\"\",Values!E22=\"\"),\"\",IF(Values!$E$4=\"1 Parameter\",Values!D22,SQRT(Values!D22^2+Values!E22^2)))","v":""},"",null,"","","","","",{"$f":"IF($DA$8=\"\",\"\",SIN(RADIANS(DH17))*Visualization!$L$20+0)","v":""},{"$f":"IF($DA$8=\"\",\"\",COS(RADIANS(DH17))*Visualization!$L$20)","v":""},{"$f":"IF(DA17=\"\",\"\",_xlfn.NUMBERVALUE(Visualization!$L$20))","v":""},{"$f":"IF(DA17=\"\",\"\",_xlfn.NUMBERVALUE(Visualization!$L$21))","v":""},"","","",{"$f":"IF(Visualization!$F$21=\"\",\"\",IF(DA17=\"\",\"\",_xlfn.NUMBERVALUE(Visualization!$F$21)))","v":""},null,null,null,null,null,null,null,null,null,null,null,null,null,null,null,null,null,null,null,null,null,null,null,"","","","","",{"$f":"IF(ER17=\"\",\"\",_xlfn.NUMBERVALUE(Visualization!$L$20))","v":""},{"$f":"IF(ER17=\"\",\"\",_xlfn.NUMBERVALUE(Visualization!$L$21))","v":""},"",{"$f":"IF(EU17=\"\",\"\",IF(Visualization!$F$21=\"\",0,Visualization!$F$21))","v":""},null,"","",null,"",null,"",null,"",null,"",null,""]
[null,null,null,null,null,null,null,null,null,null,null,null,null,null,null,null,null,null,null,null,null,null,null,null,null,null,null,null,null,null,null,null,null,null,null,null,null,null,null,null,null,null,null,null,null,null,null,null,null,null,null,null,null,null,null,null,null,null,null,null,null,null,null,null,null,null,null,null,null,null,"I - LEL",{"$f":"IF(BQ6=\"\",\"\",$BQ$6-(3*$BT$6)/BS12)","v":""},null,null,null,null,null,null,null,null,null,null,null,null,null,null,null,null,null,null,null,null,null,null,null,null,null,null,null,null,null,null,null,{"$f":"IF(Values!C23=\"\",\"\",CZ17+1)","v":""},{"$f":"IF(AND(Values!D23=\"\",Values!E23=\"\"),\"\",IF(Values!$E$4=\"1 Parameter\",Values!D23,SQRT(Values!D23^2+Values!E23^2)))","v":""},"",null,"","","","","",{"$f":"IF($DA$8=\"\",\"\",SIN(RADIANS(DH18))*Visualization!$L$20+0)","v":""},{"$f":"IF($DA$8=\"\",\"\",COS(RADIANS(DH18))*Visualization!$L$20)","v":""},{"$f":"IF(DA18=\"\",\"\",_xlfn.NUMBERVALUE(Visualization!$L$20))","v":""},{"$f":"IF(DA18=\"\",\"\",_xlfn.NUMBERVALUE(Visualization!$L$21))","v":""},"","","",{"$f":"IF(Visualization!$F$21=\"\",\"\",IF(DA18=\"\",\"\",_xlfn.NUMBERVALUE(Visualization!$F$21)))","v":""},null,null,null,null,null,"USL",{"$f":"_xlfn.NUMBERVALUE(Visualization!$L$20)","v":0},null,"USL",{"$f":"DW18","v":0},null,{"$f":"DY18","v":"USL"},0,null,"USL",{"$f":"IFERROR(LN(DW18),\"\")","v":""},null,"USL",{"$f":"EC18","v":0},null,"USL",{"$f":"EI18","v":0},null,"",{"$f":"IF(EN18=\"\",\"\",IF(OR(COUNT($DA$8:$DA$57)=EO17,EO17=\"\"),\"\",FREQUENCY($DA$8:$DA$57,EN18)))","v":""},"","","",{"$f":"IF(ER18=\"\",\"\",_xlfn.NUMBERVALUE(Visualization!$L$20))","v":""},{"$f":"IF(ER18=\"\",\"\",_xlfn.NUMBERVALUE(Visualization!$L$21))","v":""},"",{"$f":"IF(EU18=\"\",\"\",IF(Visualization!$F$21=\"\",0,Visualization!$F$21))","v":""},null,"","",null,"",null,"",null,"",null,"",null,""]
[null,null,"Distribution decision by System",null,null,{"$f":"IF(Values!E4=\"1 Parameter\",Calculation!E13,Calculation!F13)","v":"Unkown"},null,null,null,null,null,null,null,null,null,null,null,null,null,null,null,null,null,null,null,null,null,null,null,null,null,null,null,null,null,null,null,null,null,null,null,null,null,null,null,null,null,null,null,null,null,null,null,null,null,null,null,null,null,null,null,null,null,null,null,null,null,null,null,null,null,null,null,null,null,null,null,null,null,null,null,null,null,null,null,null,null,null,null,null,null,null,null,null,null,null,null,null,null,null,null,null,null,{"$f":"IF(Values!C24=\"\",\"\",CZ18+1)","v":""},{"$f":"IF(AND(Values!D24=\"\",Values!E24=\"\"),\"\",IF(Values!$E$4=\"1 Parameter\",Values!D24,SQRT(Values!D24^2+Values!E24^2)))","v":""},"",null,"","","","","",{"$f":"IF($DA$8=\"\",\"\",SIN(RADIANS(DH19))*Visualization!$L$20+0)","v":""},{"$f":"IF($DA$8=\"\",\"\",COS(RADIANS(DH19))*Visualization!$L$20)","v":""},{"$f":"IF(DA19=\"\",\"\",_xlfn.NUMBERVALUE(Visualization!$L$20))","v":""},{"$f":"IF(DA19=\"\",\"\",_xlfn.NUMBERVALUE(Visualization!$L$21))","v":""},"","","",{"$f":"IF(Visualization!$F$21=\"\",\"\",IF(DA19=\"\",\"\",_xlfn.NUMBERVALUE(Visualization!$F$21)))","v":""},null,"The VDA standard for the calculated Cmk indicie is 1.67 (equal to 0.2722 ppm). Customer sometimes request a higher Cmk indicie with 2.00 (equal to 0.001 ppm)  ",null,null,null,"LSL",{"$f":"_xlfn.NUMBERVALUE(Visualization!$L$21)","v":0},null,{"$f":"DV19","v":"LSL"},{"$f":"DW19","v":0},null,"LSL",0,null,"LSL",{"$f":"IFERROR(LN(DW19),0)","v":0},null,"LSL",{"$f":"EC19","v":0},null,"LSL",{"$f":"EI19","v":0},null,"",{"$f":"IF(EN19=\"\",\"\",IF(OR(COUNT($DA$8:$DA$57)=EO18,EO18=\"\"),\"\",FREQUENCY($DA$8:$DA$57,EN19)))","v":""},"","","",{"$f":"IF(ER19=\"\",\"\",_xlfn.NUMBERVALUE(Visualization!$L$20))","v":""},{"$f":"IF(ER19=\"\",\"\",_xlfn.NUMBERVALUE(Visualization!$L$21))","v":""},"",{"$f":"IF(EU19=\"\",\"\",IF(Visualization!$F$21=\"\",0,Visualization!$F$21))","v":""},null,"","",null,"",null,"",null,"",null,"",null,""]
[null,null,"Distribution decision by Operator",null,null,null,null,null,null,null,null,null,null,null,null,null,null,null,null,null,null,null,null,null,null,null,null,null,null,null,null,null,null,null,null,null,null,null,null,null,null,null,null,null,null,null,null,null,null,null,null,null,null,null,null,null,null,null,null,null,null,null,null,null,null,null,null,null,null,null,null,null,null,null,null,null,null,null,null,null,null,null,null,null,null,null,null,null,null,null,null,null,null,null,null,null,null,null,null,null,null,null,null,{"$f":"IF(Values!C25=\"\",\"\",CZ19+1)","v":""},{"$f":"IF(AND(Values!D25=\"\",Values!E25=\"\"),\"\",IF(Values!$E$4=\"1 Parameter\",Values!D25,SQRT(Values!D25^2+Values!E25^2)))","v":""},"",null,"","","","","",{"$f":"IF($DA$8=\"\",\"\",SIN(RADIANS(DH20))*Visualization!$L$20+0)","v":""},{"$f":"IF($DA$8=\"\",\"\",COS(RADIANS(DH20))*Visualization!$L$20)","v":""},{"$f":"IF(DA20=\"\",\"\",_xlfn.NUMBERVALUE(Visualization!$L$20))","v":""},{"$f":"IF(DA20=\"\",\"\",_xlfn.NUMBERVALUE(Visualization!$L$21))","v":""},"","","",{"$f":"IF(Visualization!$F$21=\"\",\"\",IF(DA20=\"\",\"\",_xlfn.NUMBERVALUE(Visualization!$F$21)))","v":""},null,null,null,null,null,"Delta T",{"$f":"MAX(DW18:DW19)-MIN(DW18:DW19)","v":0},null,{"$f":"DV20","v":"Delta T"},{"$f":"DW20","v":0},null,"Delta T",0,null,"Delta T",{"$f":"MAX(EF18:EF19)-MIN(EF18:EF19)","v":0},null,"Delta T",{"$f":"MAX(EI18:EI19)-MIN(EI18:EI19)","v":0},null,"Delta T",{"$f":"DW20","v":0},null,"","","","","",{"$f":"IF(ER20=\"\",\"\",_xlfn.NUMBERVALUE(Visualization!$L$20))","v":""},{"$f":"IF(ER20=\"\",\"\",_xlfn.NUMBERVALUE(Visualization!$L$21))","v":""},"",{"$f":"IF(EU20=\"\",\"\",IF(Visualization!$F$21=\"\",0,Visualization!$F$21))","v":""},null,"","",null,"",null,"",null,"",null,"",null,""]
[null,null,null,null,null,null,null,null,"The decision which test of normalety will be done is handelt by the Worksheet itselfe. Factors of the decision is the amount of measurements. The user can switch on/off test methods, in case the user have different information.",null,null,null,null,null,null,null,null,null,null,"The decision which test of normalety will be done is handelt by the Worksheet itselfe. Factors of the decision is the amount of measurements. The user can switch on/off test methods, in case the user have different information.",null,null,null,null,null,null,null,null,null,null,"The decision which test of normalety will be done is handelt by the Worksheet itselfe. Factors of the decision is the amount of measurements. The user can switch on/off test methods, in case the user have different information.",null,null,null,null,null,null,null,null,null,"The decision which test of normalety will be done is handelt by the Worksheet itselfe. Factors of the decision is the amount of measurements. The user can switch on/off test methods, in case the user have different information.",null,null,null,null,null,null,null,null,null,"The decision which test of normalety will be done is handelt by the Worksheet itselfe. Factors of the decision is the amount of measurements. The user can switch on/off test methods, in case the user have different information.",null,null,null,null,null,null,null,null,null,null,null,null,null,null,null,null,null,"I - Values",null,null,"I - Values",null,null,"I - Values",null,null,"I - Values",null,null,"I - Values",null,null,"I - Values",null,null,"I - Values",null,null,"I - Values",null,null,"I - Values",null,null,"I - Values",null,null,null,null,null,null,null,{"$f":"IF(Values!C26=\"\",\"\",CZ20+1)","v":""},{"$f":"IF(AND(Values!D26=\"\",Values!E26=\"\"),\"\",IF(Values!$E$4=\"1 Parameter\",Values!D26,SQRT(Values!D26^2+Values!E26^2)))","v":""},"",null,"","","","","",{"$f":"IF($DA$8=\"\",\"\",SIN(RADIANS(DH21))*Visualization!$L$20+0)","v":""},{"$f":"IF($DA$8=\"\",\"\",COS(RADIANS(DH21))*Visualization!$L$20)","v":""},{"$f":"IF(DA21=\"\",\"\",_xlfn.NUMBERVALUE(Visualization!$L$20))","v":""},{"$f":"IF(DA21=\"\",\"\",_xlfn.NUMBERVALUE(Visualization!$L$21))","v":""},"","","",{"$f":"IF(Visualization!$F$21=\"\",\"\",IF(DA21=\"\",\"\",_xlfn.NUMBERVALUE(Visualization!$F$21)))","v":""},null,null,null,null,null,"Limited",{"$f":"Visualization!$F$22","v":0},null,"Limited",{"$f":"Visualization!$F$22","v":0},null,"Limited",{"$f":"DW21","v":0},null,"Limited",{"$f":"DW21","v":0},null,"Limited",{"$f":"DZ21","v":0},null,"Limited",{"$f":"DW21","v":0},null,"","","","","",{"$f":"IF(ER21=\"\",\"\",_xlfn.NUMBERVALUE(Visualization!$L$20))","v":""},{"$f":"IF(ER21=\"\",\"\",_xlfn.NUMBERVALUE(Visualization!$L$21))","v":""},"",{"$f":"IF(EU21=\"\",\"\",IF(Visualization!$F$21=\"\",0,Visualization!$F$21))","v":""},null,"","",null,"",null,"",null,"",null,"",null,""]
[null,null,"Calculated Cm based on Distribution",null,null,{"$f":"IFERROR(IF(Result_Distribution_1178=\"Normal\",Calculation!$DW$40,IF(Result_Distribution_1178=\"LogNormal\",Calculation!$EF$40,IF(Result_Distribution_1178=\"Rayleigh\",Calculation!$DZ$40,IF(Result_Distribution_1178=\"Trunc-Normal\",Calculation!$EC$40,IF(Result_Distribution_1178=\"Weibull\",Calculation!$EI$40,Calculation!$EL$40))))),\"\")","v":""},null,null,null,null,null,null,null,null,null,null,null,null,null,null,null,null,null,null,null,null,null,null,null,null,null,null,null,null,null,null,null,null,null,null,null,null,null,null,null,null,null,null,null,null,null,null,null,null,null,null,null,null,null,null,null,null,null,null,null,null,null,"Max",{"$f":"IF(BQ6=\"\",\"\",DW9)","v":""},null,"Min",{"$f":"IF(BQ26<0,BQ26*-1,BQ26)","v":""},null,"Max",{"$f":"IF(BW6=\"\",\"\",DZ9)","v":""},null,"Min",{"$f":"BW26","v":""},null,"Max",{"$f":"CO22","v":""},null,"Min",{"$f":"CC26","v":""},null,"Max",{"$f":"CO22","v":""},null,"Min",{"$f":"CI26","v":""},null,"Max",{"$f":"IF(DA8=\"\",\"\",EXP(EF9))","v":""},null,"Min",{"$f":"CO26","v":""},null,null,null,null,null,null,null,{"$f":"IF(Values!C27=\"\",\"\",CZ21+1)","v":""},{"$f":"IF(AND(Values!D27=\"\",Values!E27=\"\"),\"\",IF(Values!$E$4=\"1 Parameter\",Values!D27,SQRT(Values!D27^2+Values!E27^2)))","v":""},"",null,"","","","","",{"$f":"IF($DA$8=\"\",\"\",SIN(RADIANS(DH22))*Visualization!$L$20+0)","v":""},{"$f":"IF($DA$8=\"\",\"\",COS(RADIANS(DH22))*Visualization!$L$20)","v":""},{"$f":"IF(DA22=\"\",\"\",_xlfn.NUMBERVALUE(Visualization!$L$20))","v":""},{"$f":"IF(DA22=\"\",\"\",_xlfn.NUMBERVALUE(Visualization!$L$21))","v":""},"","","",{"$f":"IF(Visualization!$F$21=\"\",\"\",IF(DA22=\"\",\"\",_xlfn.NUMBERVALUE(Visualization!$F$21)))","v":""},null,null,null,null,null,"Setpoint",{"$f":"Visualization!$F$21","v":0},null,"Setpoint",{"$f":"Visualization!$F$21","v":0},null,"Setpoint",{"$f":"DW22","v":0},null,"Setpoint",{"$f":"IFERROR(LN(EC22),0)","v":0},null,"Setpoint",{"$f":"EC22","v":0},null,"Setpoint",{"$f":"DW22","v":0},null,"","","","","",{"$f":"IF(ER22=\"\",\"\",_xlfn.NUMBERVALUE(Visualization!$L$20))","v":""},{"$f":"IF(ER22=\"\",\"\",_xlfn.NUMBERVALUE(Visualization!$L$21))","v":""},"",{"$f":"IF(EU22=\"\",\"\",IF(Visualization!$F$21=\"\",0,Visualization!$F$21))","v":""},null,"","",null,"",null,"",null,"",null,"",null,""]
[null,null,"Calculated Cmk based on Distribution",null,null,{"$f":"IFERROR(IF(Result_Distribution_1178=\"Normal\",Calculation!$DW$43,IF(Result_Distribution_1178=\"LogNormal\",Calculation!$EF$43,IF(Result_Distribution_1178=\"Rayleigh\",Calculation!$DZ$43,IF(Result_Distribution_1178=\"Trunc-Normal\",Calculation!$EC$43,IF(Result_Distribution_1178=\"Weibull\",Calculation!$EI$43,Calculation!$EL$43))))),\"\")","v":""},null,null,null,null,null,null,null,null,null,null,null,null,null,null,null,null,null,null,null,null,null,null,null,null,null,null,null,null,null,null,null,null,null,null,null,null,null,null,null,null,null,null,null,null,null,null,null,null,null,null,null,null,null,null,null,null,null,null,null,null,null,"Q3",{"$f":"IF(BQ6=\"\",\"\",QUARTILE(DA8:DA57,3))","v":""},null,"∆ (Q1;Min)",{"$f":"IF(BT22=\"\",\"\",BQ25-BQ26)","v":""},null,"Q3",{"$f":"IF(DA8=\"\",\"\",EXP(((LN(LN(1/(1-0.75))))/BZ44)+LN(BZ45)))","v":""},null,"∆ (Q1;Min)",{"$f":"IF(BZ22=\"\",\"\",BW25-BW26)","v":""},null,"Q3",{"$f":"IF(DA8=\"\",\"\",_xlfn.NORM.S.INV(_xlfn.NORM.S.DIST(EC26,TRUE)+0.75*(1-_xlfn.NORM.S.DIST(EC26,TRUE)))*EC29+EC28)","v":""},null,"∆ (Q1;Min)",{"$f":"IF(CF22=\"\",\"\",CC25-CC26)","v":""},null,"Q3",{"$f":"IF(DA8=\"\",\"\",EXP(IF(CI6=\"\",\"\",QUARTILE(DB8:DB57,3))))","v":""},null,"∆ (Q1;Min)",{"$f":"IF(CL22=\"\",\"\",CI25-CI26)","v":""},null,"Q3",{"$f":"IF(DA8=\"\",\"\",EXP(((LN(LN(1/(1-0.75))))/CR44)+LN(CR45)))","v":""},null,"∆ (Q1;Min)",{"$f":"IF(CR22=\"\",\"\",CO25-CO26)","v":""},null,null,null,null,null,null,null,{"$f":"IF(Values!C28=\"\",\"\",CZ22+1)","v":""},{"$f":"IF(AND(Values!D28=\"\",Values!E28=\"\"),\"\",IF(Values!$E$4=\"1 Parameter\",Values!D28,SQRT(Values!D28^2+Values!E28^2)))","v":""},"",null,"","","","","",{"$f":"IF($DA$8=\"\",\"\",SIN(RADIANS(DH23))*Visualization!$L$20+0)","v":""},{"$f":"IF($DA$8=\"\",\"\",COS(RADIANS(DH23))*Visualization!$L$20)","v":""},{"$f":"IF(DA23=\"\",\"\",_xlfn.NUMBERVALUE(Visualization!$L$20))","v":""},{"$f":"IF(DA23=\"\",\"\",_xlfn.NUMBERVALUE(Visualization!$L$21))","v":""},"","","",{"$f":"IF(Visualization!$F$21=\"\",\"\",IF(DA23=\"\",\"\",_xlfn.NUMBERVALUE(Visualization!$F$21)))","v":""},null,null,null,null,null,null,null,null,null,null,null,"µt",{"$f":"IFERROR(AVERAGE(DA8:DA57),\"\")","v":""},null,null,null,null,null,null,null,null,null,null,"","","","","",{"$f":"IF(ER23=\"\",\"\",_xlfn.NUMBERVALUE(Visualization!$L$20))","v":""},{"$f":"IF(ER23=\"\",\"\",_xlfn.NUMBERVALUE(Visualization!$L$21))","v":""},"",{"$f":"IF(EU23=\"\",\"\",IF(Visualization!$F$21=\"\",0,Visualization!$F$21))","v":""},null,"","",null,"",null,"",null,"",null,"",null,""]
[null,null,null,null,null,null,null,null,null,null,null,null,null,null,null,null,null,null,null,null,null,null,null,null,null,null,null,null,null,null,null,null,null,null,null,null,null,null,null,null,null,null,null,null,null,null,null,null,null,null,null,null,null,null,null,null,null,null,null,null,null,null,null,null,null,null,null,"Med",{"$f":"IF(BQ6=\"\",\"\",MEDIAN(DA8:DA57))","v":""},null,"∆ (Med;Q1)",{"$f":"IF(BT22=\"\",\"\",BQ24-BQ25)","v":""},null,"Med",{"$f":"IF(BW6=\"\",\"\",BW7)","v":""},null,"∆ (Med;Q1)",{"$f":"IF(BZ22=\"\",\"\",BW24-BW25)","v":""},null,"Med",{"$f":"CC7","v":""},null,"∆ (Med;Q1)",{"$f":"IF(CF22=\"\",\"\",CC24-CC25)","v":""},null,"Med",{"$f":"CO24","v":""},null,"∆ (Med;Q1)",{"$f":"IF(CL22=\"\",\"\",CI24-CI25)","v":""},null,"Med",{"$f":"CO7","v":""},null,"∆ (Med;Q1)",{"$f":"IF(CR22=\"\",\"\",CO24-CO25)","v":""},null,null,null,null,null,null,null,{"$f":"IF(Values!C29=\"\",\"\",CZ23+1)","v":""},{"$f":"IF(AND(Values!D29=\"\",Values!E29=\"\"),\"\",IF(Values!$E$4=\"1 Parameter\",Values!D29,SQRT(Values!D29^2+Values!E29^2)))","v":""},"",null,"","","","","",{"$f":"IF($DA$8=\"\",\"\",SIN(RADIANS(DH24))*Visualization!$L$20+0)","v":""},{"$f":"IF($DA$8=\"\",\"\",COS(RADIANS(DH24))*Visualization!$L$20)","v":""},{"$f":"IF(DA24=\"\",\"\",_xlfn.NUMBERVALUE(Visualization!$L$20))","v":""},{"$f":"IF(DA24=\"\",\"\",_xlfn.NUMBERVALUE(Visualization!$L$21))","v":""},"","","",{"$f":"IF(Visualization!$F$21=\"\",\"\",IF(DA24=\"\",\"\",_xlfn.NUMBERVALUE(Visualization!$F$21)))","v":""},null,null,null,null,null,null,null,null,null,null,null,"σt",{"$f":"IFERROR(_xlfn.STDEV.S(DA8:DA57),\"\")","v":""},null,null,null,null,null,null,null,null,null,null,"","","","","",{"$f":"IF(ER24=\"\",\"\",_xlfn.NUMBERVALUE(Visualization!$L$20))","v":""},{"$f":"IF(ER24=\"\",\"\",_xlfn.NUMBERVALUE(Visualization!$L$21))","v":""},"",{"$f":"IF(EU24=\"\",\"\",IF(Visualization!$F$21=\"\",0,Visualization!$F$21))","v":""},null,"","",null,"",null,"",null,"",null,"",null,""]
[null,null,null,null,null,null,null,null,null,null,null,null,null,null,null,null,null,null,null,null,null,null,null,null,null,null,null,null,null,null,null,null,null,null,null,null,null,null,null,null,null,null,null,null,null,null,null,null,null,null,null,null,null,null,null,null,null,null,null,null,null,null,null,null,null,null,null,"Q1",{"$f":"IF(BQ6=\"\",\"\",QUARTILE(DA8:DA57,1))","v":""},null,"∆ (Q3;Med)",{"$f":"IF(BT22=\"\",\"\",BQ23-BQ24)","v":""},null,"Q1",{"$f":"IF(DA8=\"\",\"\",EXP(((LN(LN(1/(1-0.25))))/BZ44)+LN(BZ45)))","v":""},null,"∆ (Q3;Med)",{"$f":"IF(BZ22=\"\",\"\",BW23-BW24)","v":""},null,"Q1",{"$f":"IF(DA8=\"\",\"\",_xlfn.NORM.S.INV(_xlfn.NORM.S.DIST(EC26,TRUE)+0.25*(1-_xlfn.NORM.S.DIST(EC26,TRUE)))*EC29+EC28)","v":""},null,"∆ (Q3;Med)",{"$f":"IF(CF22=\"\",\"\",CC23-CC24)","v":""},null,"Q1",{"$f":"IF(DA8=\"\",\"\",EXP(IF(CI6=\"\",\"\",QUARTILE(DB8:DB57,1))))","v":""},null,"∆ (Q3;Med)",{"$f":"IF(CL22=\"\",\"\",CI23-CI24)","v":""},null,"Q1",{"$f":"IF(DA8=\"\",\"\",EXP(((LN(LN(1/(1-0.25))))/CR44)+LN(CR45)))","v":""},null,"∆ (Q3;Med)",{"$f":"IF(CR22=\"\",\"\",CO23-CO24)","v":""},null,null,null,null,null,null,null,{"$f":"IF(Values!C30=\"\",\"\",CZ24+1)","v":""},{"$f":"IF(AND(Values!D30=\"\",Values!E30=\"\"),\"\",IF(Values!$E$4=\"1 Parameter\",Values!D30,SQRT(Values!D30^2+Values!E30^2)))","v":""},"",null,"","","","","",{"$f":"IF($DA$8=\"\",\"\",SIN(RADIANS(DH25))*Visualization!$L$20+0)","v":""},{"$f":"IF($DA$8=\"\",\"\",COS(RADIANS(DH25))*Visualization!$L$20)","v":""},{"$f":"IF(DA25=\"\",\"\",_xlfn.NUMBERVALUE(Visualization!$L$20))","v":""},{"$f":"IF(DA25=\"\",\"\",_xlfn.NUMBERVALUE(Visualization!$L$21))","v":""},"","","",{"$f":"IF(Visualization!$F$21=\"\",\"\",IF(DA25=\"\",\"\",_xlfn.NUMBERVALUE(Visualization!$F$21)))","v":""},null,null,null,null,null,"µ",{"$f":"BQ6","v":""},null,null,null,null,"µt/σt",{"$f":"IFERROR(EC23/EC24,\"\")","v":""},null,null,null,null,null,null,null,null,null,null,"","","","","",{"$f":"IF(ER25=\"\",\"\",_xlfn.NUMBERVALUE(Visualization!$L$20))","v":""},{"$f":"IF(ER25=\"\",\"\",_xlfn.NUMBERVALUE(Visualization!$L$21))","v":""},"",{"$f":"IF(EU25=\"\",\"\",IF(Visualization!$F$21=\"\",0,Visualization!$F$21))","v":""},null,"","",null,"",null,"",null,"",null,"",null,""]
[null,null,null,null,null,null,null,null,null,null,null,null,null,null,null,null,null,null,null,null,null,null,null,null,null,null,null,null,null,null,null,null,null,null,null,null,null,null,null,null,null,null,null,null,null,null,null,null,null,null,null,null,null,null,null,null,null,null,null,null,null,null,null,null,null,null,null,"Min",{"$f":"IF(BQ6=\"\",\"\",DW10)","v":""},null,"∆ (Q3;Max)",{"$f":"IF(BT22=\"\",\"\",BQ22-BQ23)","v":""},null,"Min",{"$f":"IF(BW6=\"\",\"\",DZ10)","v":""},null,"∆ (Q3;Max)",{"$f":"IF(BZ22=\"\",\"\",BW22-BW23)","v":""},null,"Min",{"$f":"CO26","v":""},null,"∆ (Q3;Max)",{"$f":"IF(CF22=\"\",\"\",CC22-CC23)","v":""},null,"Min",{"$f":"CO26","v":""},null,"∆ (Q3;Max)",{"$f":"IF(CL22=\"\",\"\",CI22-CI23)","v":""},null,"Min",{"$f":"IF(DA8=\"\",\"\",EXP(CN34))","v":""},null,"∆ (Q3;Max)",{"$f":"IF(CR22=\"\",\"\",CO22-CO23)","v":""},null,null,null,null,null,null,null,{"$f":"IF(Values!C31=\"\",\"\",CZ25+1)","v":""},{"$f":"IF(AND(Values!D31=\"\",Values!E31=\"\"),\"\",IF(Values!$E$4=\"1 Parameter\",Values!D31,SQRT(Values!D31^2+Values!E31^2)))","v":""},"",null,"","","","","",{"$f":"IF($DA$8=\"\",\"\",SIN(RADIANS(DH26))*Visualization!$L$20+0)","v":""},{"$f":"IF($DA$8=\"\",\"\",COS(RADIANS(DH26))*Visualization!$L$20)","v":""},{"$f":"IF(DA26=\"\",\"\",_xlfn.NUMBERVALUE(Visualization!$L$20))","v":""},{"$f":"IF(DA26=\"\",\"\",_xlfn.NUMBERVALUE(Visualization!$L$21))","v":""},"","","",{"$f":"IF(Visualization!$F$21=\"\",\"\",IF(DA26=\"\",\"\",_xlfn.NUMBERVALUE(Visualization!$F$21)))","v":""},null,null,null,null,null,"median",{"$f":"BQ7","v":""},null,null,null,null,"alpha",{"$f":"IFERROR((0-EC23)/EC24,\"\")","v":""},null,null,null,null,null,null,null,null,null,null,"","","","","",{"$f":"IF(ER26=\"\",\"\",_xlfn.NUMBERVALUE(Visualization!$L$20))","v":""},{"$f":"IF(ER26=\"\",\"\",_xlfn.NUMBERVALUE(Visualization!$L$21))","v":""},"",{"$f":"IF(EU26=\"\",\"\",IF(Visualization!$F$21=\"\",0,Visualization!$F$21))","v":""},null,"","",null,"",null,"",null,"",null,"",null,""]
[null,null,"Cm Result",{"$f":"IF(Visualization!F51=\"\",\"\",IF(AND(F22=\"\",F23=\"\"),\"NG\",IF(F22=\"\",\"Pass\",IF(Visualization!G58>=Visualization!G57,\"Pass\",\"NG\"))))","v":""},null,null,null,null,null,null,null,null,null,null,null,null,null,null,null,null,null,null,null,null,null,null,null,null,null,null,null,null,null,null,null,null,null,null,null,null,null,null,null,null,null,null,null,null,null,null,null,null,null,null,null,null,null,null,null,null,null,null,null,null,null,null,null,"Maximum - Q3",{"$f":"IF(BQ22=\"\",\"\",BQ22-BQ26)","v":""},null,null,null,null,"Maximum - Q3",{"$f":"IF(BW22=\"\",\"\",BW22-BW26)","v":""},null,null,null,null,"Maximum - Q3",{"$f":"IF(CC22=\"\",\"\",CC22-CC26)","v":""},null,null,null,null,"Maximum - Q3",{"$f":"IF(CI22=\"\",\"\",CI22-CI26)","v":""},null,null,null,null,"Maximum - Q3",{"$f":"IF(CO22=\"\",\"\",CO22-CO26)","v":""},null,null,null,null,null,null,null,null,null,null,{"$f":"IF(Values!C32=\"\",\"\",CZ26+1)","v":""},{"$f":"IF(AND(Values!D32=\"\",Values!E32=\"\"),\"\",IF(Values!$E$4=\"1 Parameter\",Values!D32,SQRT(Values!D32^2+Values!E32^2)))","v":""},"",null,"","","","","",{"$f":"IF($DA$8=\"\",\"\",SIN(RADIANS(DH27))*Visualization!$L$20+0)","v":""},{"$f":"IF($DA$8=\"\",\"\",COS(RADIANS(DH27))*Visualization!$L$20)","v":""},{"$f":"IF(DA27=\"\",\"\",_xlfn.NUMBERVALUE(Visualization!$L$20))","v":""},{"$f":"IF(DA27=\"\",\"\",_xlfn.NUMBERVALUE(Visualization!$L$21))","v":""},"","","",{"$f":"IF(Visualization!$F$21=\"\",\"\",IF(DA27=\"\",\"\",_xlfn.NUMBERVALUE(Visualization!$F$21)))","v":""},null,null,null,null,null,{"$f":"DV14","v":"Sigma"},{"$f":"DW14","v":""},null,null,null,null,"z",{"$f":"IFERROR(1-_xlfn.NORM.S.DIST(EC26,TRUE),\"\")","v":""},null,null,null,null,null,null,null,"Median",{"$f":"BQ7","v":""},null,"","","","","",{"$f":"IF(ER27=\"\",\"\",_xlfn.NUMBERVALUE(Visualization!$L$20))","v":""},{"$f":"IF(ER27=\"\",\"\",_xlfn.NUMBERVALUE(Visualization!$L$21))","v":""},"",{"$f":"IF(EU27=\"\",\"\",IF(Visualization!$F$21=\"\",0,Visualization!$F$21))","v":""},null,"","",null,"",null,"",null,"",null,"",null,""]
[null,null,"Cmk Result",{"$f":"IF(Visualization!F51=\"\",\"\",IF(F23=\"\",\"NG\",IF(Visualization!G61>=Visualization!G60,\"Pass\",\"NG\")))","v":""},null,null,null,null,null,null,null,null,null,null,null,null,null,null,null,null,null,null,null,null,null,null,null,null,null,null,null,null,null,null,null,null,null,null,null,null,null,null,null,null,null,null,null,null,null,null,null,null,null,null,null,null,null,null,null,null,null,null,null,null,null,null,null,"Q1-Minimum",{"$f":"IF(BQ22=\"\",\"\",BQ25-BQ26)","v":""},null,null,null,null,"Q1-Minimum",{"$f":"IF(BW22=\"\",\"\",BW25-BW26)","v":""},null,null,null,null,"Q1-Minimum",{"$f":"IF(CC22=\"\",\"\",CC25-CC26)","v":""},null,"<",null,null,"Q1-Minimum",{"$f":"IF(CI22=\"\",\"\",CI25-CI26)","v":""},null,null,null,null,"Q1-Minimum",{"$f":"IF(CO22=\"\",\"\",CO25-CO26)","v":""},null,null,null,null,null,null,null,null,null,null,{"$f":"IF(Values!C33=\"\",\"\",CZ27+1)","v":""},{"$f":"IF(AND(Values!D33=\"\",Values!E33=\"\"),\"\",IF(Values!$E$4=\"1 Parameter\",Values!D33,SQRT(Values!D33^2+Values!E33^2)))","v":""},"",null,"","","","","",{"$f":"IF($DA$8=\"\",\"\",SIN(RADIANS(DH28))*Visualization!$L$20+0)","v":""},{"$f":"IF($DA$8=\"\",\"\",COS(RADIANS(DH28))*Visualization!$L$20)","v":""},{"$f":"IF(DA28=\"\",\"\",_xlfn.NUMBERVALUE(Visualization!$L$20))","v":""},{"$f":"IF(DA28=\"\",\"\",_xlfn.NUMBERVALUE(Visualization!$L$21))","v":""},"","","",{"$f":"IF(Visualization!$F$21=\"\",\"\",IF(DA28=\"\",\"\",_xlfn.NUMBERVALUE(Visualization!$F$21)))","v":""},null,null,null,null,null,null,null,null,null,null,null,"µ",{"$f":"IFERROR(EC23+(EC24*(_xlfn.NORM.DIST(EC26,EC23,EC24,FALSE))/EC27),\"\")","v":""},null,null,null,null,null,null,null,"Range",{"$f":"IF(DA8=\"\",\"\",EL9-EL10)","v":""},null,"",{"$f":"IF(EN28=\"\",\"\",IF(OR(COUNT($DA$8:$DA$57)=EO27,EO27=\"\"),\"\",FREQUENCY($DA$8:$DA$57,EN28)))","v":""},{"$f":"IF(EO28=\"\",\"\",EO28-EO27)","v":""},"","",{"$f":"IF(ER28=\"\",\"\",_xlfn.NUMBERVALUE(Visualization!$L$20))","v":""},{"$f":"IF(ER28=\"\",\"\",_xlfn.NUMBERVALUE(Visualization!$L$21))","v":""},"",{"$f":"IF(EU28=\"\",\"\",IF(Visualization!$F$21=\"\",0,Visualization!$F$21))","v":""},null,"","",null,"",null,"",null,"",null,"",null,""]
[null,null,"Distribution",{"$f":"IF(Visualization!F51=\"\",\"\",IF(F20<>\"\",\"Pass\",IF(OR(F19=\"Unkown\",F19=\"Weibull\"),\"NG\",\"Pass\")))","v":""},null,null,null,null,null,null,null,null,null,null,null,null,null,null,null,null,null,null,null,null,null,null,null,null,null,null,null,null,null,null,null,null,null,null,null,null,null,null,null,null,null,null,null,null,null,null,null,null,null,null,null,null,null,null,null,null,null,null,null,null,null,null,null,null,null,null,null,null,null,null,null,null,null,null,null,null,null,null,null,null,null,null,null,null,null,null,null,null,null,null,null,null,null,null,null,null,null,null,null,{"$f":"IF(Values!C34=\"\",\"\",CZ28+1)","v":""},{"$f":"IF(AND(Values!D34=\"\",Values!E34=\"\"),\"\",IF(Values!$E$4=\"1 Parameter\",Values!D34,SQRT(Values!D34^2+Values!E34^2)))","v":""},"",null,"","","","","",{"$f":"IF($DA$8=\"\",\"\",SIN(RADIANS(DH29))*Visualization!$L$20+0)","v":""},{"$f":"IF($DA$8=\"\",\"\",COS(RADIANS(DH29))*Visualization!$L$20)","v":""},{"$f":"IF(DA29=\"\",\"\",_xlfn.NUMBERVALUE(Visualization!$L$20))","v":""},{"$f":"IF(DA29=\"\",\"\",_xlfn.NUMBERVALUE(Visualization!$L$21))","v":""},"","","",{"$f":"IF(Visualization!$F$21=\"\",\"\",IF(DA29=\"\",\"\",_xlfn.NUMBERVALUE(Visualization!$F$21)))","v":""},null,null,null,null,null,null,null,null,null,null,null,"σ",{"$f":"IFERROR(EC24^2*(1+EC26*_xlfn.NORM.DIST(EC26,EC23,EC24,FALSE)/EC27-(_xlfn.NORM.DIST(EC26,EC23,EC24,FALSE))),\"\")","v":""},null,null,null,null,null,null,null,"dn",{"$f":"IF(DA8=\"\",\"\",(1.748*(LN(EL8))^0.693))","v":""},null,"","","","","",{"$f":"IF(ER29=\"\",\"\",_xlfn.NUMBERVALUE(Visualization!$L$20))","v":""},{"$f":"IF(ER29=\"\",\"\",_xlfn.NUMBERVALUE(Visualization!$L$21))","v":""},"",{"$f":"IF(EU29=\"\",\"\",IF(Visualization!$F$21=\"\",0,Visualization!$F$21))","v":""},null,"","",null,"",null,"",null,"",null,"",null,""]
[null,null,null,null,null,null,null,null,null,null,null,null,null,null,null,null,null,null,null,null,null,null,null,null,null,null,null,null,null,null,null,null,null,null,null,null,null,null,null,null,null,null,null,null,null,null,null,null,null,null,null,null,null,null,null,null,null,null,null,null,null,null,null,null,null,null,null,null,null,null,null,null,null,null,null,null,null,null,null,null,null,null,null,null,null,null,null,null,null,null,null,null,null,null,null,null,null,null,null,null,null,null,null,{"$f":"IF(Values!C35=\"\",\"\",CZ29+1)","v":""},{"$f":"IF(AND(Values!D35=\"\",Values!E35=\"\"),\"\",IF(Values!$E$4=\"1 Parameter\",Values!D35,SQRT(Values!D35^2+Values!E35^2)))","v":""},"",null,"","","","","",{"$f":"IF($DA$8=\"\",\"\",SIN(RADIANS(DH30))*Visualization!$L$20+0)","v":""},{"$f":"IF($DA$8=\"\",\"\",COS(RADIANS(DH30))*Visualization!$L$20)","v":""},{"$f":"IF(DA30=\"\",\"\",_xlfn.NUMBERVALUE(Visualization!$L$20))","v":""},{"$f":"IF(DA30=\"\",\"\",_xlfn.NUMBERVALUE(Visualization!$L$21))","v":""},"","","",{"$f":"IF(Visualization!$F$21=\"\",\"\",IF(DA30=\"\",\"\",_xlfn.NUMBERVALUE(Visualization!$F$21)))","v":""},null,null,null,null,null,null,null,null,null,null,null,null,null,null,null,null,null,null,null,null,"k",{"$f":"IF(DA8=\"\",\"\",6/EL29)","v":""},null,"","","","","",{"$f":"IF(ER30=\"\",\"\",_xlfn.NUMBERVALUE(Visualization!$L$20))","v":""},{"$f":"IF(ER30=\"\",\"\",_xlfn.NUMBERVALUE(Visualization!$L$21))","v":""},"",{"$f":"IF(EU30=\"\",\"\",IF(Visualization!$F$21=\"\",0,Visualization!$F$21))","v":""},null,"","",null,"",null,"",null,"",null,"",null,""]
[null,null,null,null,null,null,null,null,null,null,null,null,null,null,null,null,null,null,null,null,null,null,null,null,null,null,null,null,null,null,null,null,null,null,null,null,null,null,null,null,null,null,null,null,null,null,null,null,null,null,null,null,null,null,null,null,null,null,null,null,null,null,null,null,null,null,null,null,null,null,null,null,null,null,null,null,null,null,null,null,null,null,null,null,null,null,null,null,null,null,null,null,null,null,null,null,null,null,null,null,null,null,null,{"$f":"IF(Values!C36=\"\",\"\",CZ30+1)","v":""},{"$f":"IF(AND(Values!D36=\"\",Values!E36=\"\"),\"\",IF(Values!$E$4=\"1 Parameter\",Values!D36,SQRT(Values!D36^2+Values!E36^2)))","v":""},"",null,"","","","","",{"$f":"IF($DA$8=\"\",\"\",SIN(RADIANS(DH31))*Visualization!$L$20+0)","v":""},{"$f":"IF($DA$8=\"\",\"\",COS(RADIANS(DH31))*Visualization!$L$20)","v":""},{"$f":"IF(DA31=\"\",\"\",_xlfn.NUMBERVALUE(Visualization!$L$20))","v":""},{"$f":"IF(DA31=\"\",\"\",_xlfn.NUMBERVALUE(Visualization!$L$21))","v":""},"","","",{"$f":"IF(Visualization!$F$21=\"\",\"\",IF(DA31=\"\",\"\",_xlfn.NUMBERVALUE(Visualization!$F$21)))","v":""},null,null,null,null,null,null,null,null,null,null,null,"ω",{"$f":"IFERROR(EC24^2/(0-EC23)^2,\"\")","v":""},null,null,null,null,null,null,null,"xc",{"$f":"IF(DA8=\"\",\"\",(EL9+EL10)/2)","v":""},null,"","","","","",{"$f":"IF(ER31=\"\",\"\",_xlfn.NUMBERVALUE(Visualization!$L$20))","v":""},{"$f":"IF(ER31=\"\",\"\",_xlfn.NUMBERVALUE(Visualization!$L$21))","v":""},"",{"$f":"IF(EU31=\"\",\"\",IF(Visualization!$F$21=\"\",0,Visualization!$F$21))","v":""},null,"","",null,"",null,"",null,"",null,"",null,""]
[null,null,null,null,null,null,null,null,null,null,null,null,null,null,null,null,null,null,null,null,null,null,null,null,null,null,null,null,null,null,null,null,null,null,null,null,null,null,null,null,null,null,null,null,null,null,null,null,null,null,null,null,null,null,null,null,null,null,null,null,null,null,null,null,null,null,null,"I - Values (Sorted)","z",null,"Value","Sigma",null,"I - Values (Sorted)","ln(ln(1/(1-F(x))))",null,"Value","Sigma",null,"I - Values (Sorted)","z",null,"Value","Sigma",null,"I - Values (Sorted)","z",null,"Value","Sigma",null,"I - Values (Sorted)","ln(ln(1/(1-F(x))))",null,"Value","Sigma",null,null,null,null,null,null,null,{"$f":"IF(Values!C37=\"\",\"\",CZ31+1)","v":""},{"$f":"IF(AND(Values!D37=\"\",Values!E37=\"\"),\"\",IF(Values!$E$4=\"1 Parameter\",Values!D37,SQRT(Values!D37^2+Values!E37^2)))","v":""},"",null,"","","","","",{"$f":"IF($DA$8=\"\",\"\",SIN(RADIANS(DH32))*Visualization!$L$20+0)","v":""},{"$f":"IF($DA$8=\"\",\"\",COS(RADIANS(DH32))*Visualization!$L$20)","v":""},{"$f":"IF(DA32=\"\",\"\",_xlfn.NUMBERVALUE(Visualization!$L$20))","v":""},{"$f":"IF(DA32=\"\",\"\",_xlfn.NUMBERVALUE(Visualization!$L$21))","v":""},"","","",{"$f":"IF(Visualization!$F$21=\"\",\"\",IF(DA32=\"\",\"\",_xlfn.NUMBERVALUE(Visualization!$F$21)))","v":""},null,null,null,null,null,null,null,null,null,null,null,"P3 (ω)",{"$f":"IFERROR(1+5.74050101*EC31-13.53427037*EC31^2+ 6.88665552*EC31^3,\"\")","v":""},null,null,null,null,null,null,null,"xo",{"$f":"IF(DA8=\"\",\"\",EL31+((EL30*EL28)/2))","v":""},null,"","","","","",{"$f":"IF(ER32=\"\",\"\",_xlfn.NUMBERVALUE(Visualization!$L$20))","v":""},{"$f":"IF(ER32=\"\",\"\",_xlfn.NUMBERVALUE(Visualization!$L$21))","v":""},"",{"$f":"IF(EU32=\"\",\"\",IF(Visualization!$F$21=\"\",0,Visualization!$F$21))","v":""},null,"","",null,"",null,"",null,"",null,"",null,""]
[null,null,null,null,null,null,null,null,null,null,null,null,null,null,null,null,null,null,null,null,null,null,null,null,null,null,null,null,null,null,null,null,null,null,null,null,null,null,null,null,null,null,null,null,null,null,null,null,null,null,null,null,null,null,null,null,null,null,null,null,null,null,null,null,null,null,null,null,null,null,null,null,null,null,null,null,null,null,null,null,null,null,null,null,null,null,null,null,null,null,null,null,null,null,null,null,null,null,null,null,null,null,null,{"$f":"IF(Values!C38=\"\",\"\",CZ32+1)","v":""},{"$f":"IF(AND(Values!D38=\"\",Values!E38=\"\"),\"\",IF(Values!$E$4=\"1 Parameter\",Values!D38,SQRT(Values!D38^2+Values!E38^2)))","v":""},"",null,"","","","","",{"$f":"IF($DA$8=\"\",\"\",SIN(RADIANS(DH33))*Visualization!$L$20+0)","v":""},{"$f":"IF($DA$8=\"\",\"\",COS(RADIANS(DH33))*Visualization!$L$20)","v":""},{"$f":"IF(DA33=\"\",\"\",_xlfn.NUMBERVALUE(Visualization!$L$20))","v":""},{"$f":"IF(DA33=\"\",\"\",_xlfn.NUMBERVALUE(Visualization!$L$21))","v":""},"","","",{"$f":"IF(Visualization!$F$21=\"\",\"\",IF(DA33=\"\",\"\",_xlfn.NUMBERVALUE(Visualization!$F$21)))","v":""},null,null,null,null,null,null,null,null,null,null,null,"P4 (ω)",{"$f":"IFERROR(-0.00374615+0.17462558*EC31-2.87168509*EC31^2+17.48932655*EC31^3-11.91716546*EC31^4,\"\")","v":""},null,null,null,null,null,null,null,"xu",{"$f":"IF(DA8=\"\",\"\",EL31-((EL30*EL28)/2))","v":""},null,"","","","","",{"$f":"IF(ER33=\"\",\"\",_xlfn.NUMBERVALUE(Visualization!$L$20))","v":""},{"$f":"IF(ER33=\"\",\"\",_xlfn.NUMBERVALUE(Visualization!$L$21))","v":""},"",{"$f":"IF(EU33=\"\",\"\",IF(Visualization!$F$21=\"\",0,Visualization!$F$21))","v":""},null,"","",null,"",null,"",null,"",null,"",null,""]
[null,null,null,null,null,null,null,null,null,null,null,null,null,null,null,null,null,null,null,null,null,null,null,null,null,null,null,null,null,null,null,null,null,null,null,null,null,null,null,null,null,null,null,null,null,null,null,null,null,null,null,null,null,null,null,null,null,null,null,null,null,null,null,null,null,null,null,{"$f":"IF(Values!C13=\"\",\"\",SMALL(Values!$D$13:$D$62,Values!C13))","v":""},{"$f":"IF(Values!D13=\"\",\"\",NORMSINV((Values!C13-0.3)/(COUNT($BP$34:$BP$83))))","v":""},null,{"$f":"IF(Visualization!F51=\"\",\"\",Visualization!F51-3*Visualization!F53)","v":""},-3,null,{"$f":"IF(BP34=\"\",\"\",CN34)","v":""},{"$f":"IF(BP34=\"\",\"\",CO34)","v":""},null,{"$f":"IF(DA8=\"\",\"\",EXP(((LN(LN(1/(1-BZ34))))/$BZ$44)+LN($BZ$45)))","v":""},1.3500000000000001E-3,null,{"$f":"BP34","v":""},{"$f":"IF(BP34=\"\",\"\",_xlfn.NORM.S.INV((Values!C13-0.5)/Calculation!$DW$8))","v":""},null,{"$f":"IF(DA8=\"\",\"\",IF(_xlfn.NORM.S.INV(_xlfn.NORM.S.DIST(EC26,TRUE)+0.00135*(1-_xlfn.NORM.S.DIST(EC26,TRUE)))*EC29+EC28<0,0,_xlfn.NORM.S.INV(_xlfn.NORM.S.DIST(EC26,TRUE)+0.00135*(1-_xlfn.NORM.S.DIST(EC26,TRUE)))*EC29+EC28))","v":""},1.3500000000000001E-3,null,{"$f":"IF(BP34=\"\",\"\",IF($CI$6=\"\",\"\",SMALL($DB$8:$DB$57,CZ8)))","v":""},{"$f":"IF(Values!D13=\"\",\"\",NORMSINV((Values!C13-0.3)/(COUNT($CH$34:$CH$83))))","v":""},null,{"$f":"IF(EF14=\"\",\"\",EXP(CI6)-3*EXP(EF14))","v":""},-3,null,{"$f":"CH34","v":""},{"$f":"IF(BP34=\"\",\"\",LN(LN(1/(1-((Values!C13-0.5)/$EI$8)))))","v":""},null,{"$f":"IF(DA8=\"\",\"\",EXP(((LN(LN(1/(1-CR34))))/$CR$44)+LN($CR$45)))","v":""},1.3500000000000001E-3,null,null,null,null,null,null,null,{"$f":"IF(Values!C39=\"\",\"\",CZ33+1)","v":""},{"$f":"IF(AND(Values!D39=\"\",Values!E39=\"\"),\"\",IF(Values!$E$4=\"1 Parameter\",Values!D39,SQRT(Values!D39^2+Values!E39^2)))","v":""},"",null,"","","","","",{"$f":"IF($DA$8=\"\",\"\",SIN(RADIANS(DH34))*Visualization!$L$20+0)","v":""},{"$f":"IF($DA$8=\"\",\"\",COS(RADIANS(DH34))*Visualization!$L$20)","v":""},{"$f":"IF(DA34=\"\",\"\",_xlfn.NUMBERVALUE(Visualization!$L$20))","v":""},{"$f":"IF(DA34=\"\",\"\",_xlfn.NUMBERVALUE(Visualization!$L$21))","v":""},"","","",{"$f":"IF(Visualization!$F$21=\"\",\"\",IF(DA34=\"\",\"\",_xlfn.NUMBERVALUE(Visualization!$F$21)))","v":""},null,null,null,null,null,null,null,null,null,null,null,"Q(ω)",{"$f":"IFERROR(EC33/EC32,\"\")","v":""},null,null,null,null,null,null,null,null,null,null,"","","","","",{"$f":"IF(ER34=\"\",\"\",_xlfn.NUMBERVALUE(Visualization!$L$20))","v":""},{"$f":"IF(ER34=\"\",\"\",_xlfn.NUMBERVALUE(Visualization!$L$21))","v":""},"",{"$f":"IF(EU34=\"\",\"\",IF(Visualization!$F$21=\"\",0,Visualization!$F$21))","v":""},null,"","",null,"",null,"",null,"",null,"",null,""]
[null,null,null,null,null,null,null,null,null,null,null,null,null,null,null,null,null,null,null,null,null,null,null,null,null,null,null,null,null,null,null,null,null,null,null,null,null,null,null,null,null,null,null,null,null,null,null,null,null,null,null,null,null,null,null,null,null,null,null,null,null,null,null,null,null,null,null,{"$f":"IF(Values!C14=\"\",\"\",SMALL(Values!$D$13:$D$62,Values!C14))","v":""},{"$f":"IF(Values!D14=\"\",\"\",NORMSINV((Values!C14-0.3)/(COUNT($BP$34:$BP$83))))","v":""},null,{"$f":"Visualization!F51","v":""},0,null,"","",null,{"$f":"IF(DA8=\"\",\"\",EXP(((LN(LN(1/(1-BZ35))))/$BZ$44)+LN($BZ$45)))","v":""},0.5,null,"",{"$f":"IF(BP35=\"\",\"\",_xlfn.NORM.S.INV((Values!C14-0.5)/Calculation!$DW$8))","v":""},null,{"$f":"CC7","v":""},0.5,null,"",{"$f":"IF(Values!D14=\"\",\"\",NORMSINV((Values!C14-0.3)/(COUNT($CH$34:$CH$83))))","v":""},null,{"$f":"IF(DA8=\"\",\"\",EXP(CI6))","v":""},0,null,{"$f":"CH35","v":""},{"$f":"IF(BP35=\"\",\"\",LN(LN(1/(1-((Values!C14-0.5)/$EI$8)))))","v":""},null,{"$f":"IF(DA8=\"\",\"\",EXP(((LN(LN(1/(1-CR35))))/$CR$44)+LN($CR$45)))","v":""},0.5,null,null,null,null,null,null,null,{"$f":"IF(Values!C40=\"\",\"\",CZ34+1)","v":""},{"$f":"IF(AND(Values!D40=\"\",Values!E40=\"\"),\"\",IF(Values!$E$4=\"1 Parameter\",Values!D40,SQRT(Values!D40^2+Values!E40^2)))","v":""},"",null,"","","","","",{"$f":"IF($DA$8=\"\",\"\",SIN(RADIANS(DH35))*Visualization!$L$20+0)","v":""},{"$f":"IF($DA$8=\"\",\"\",COS(RADIANS(DH35))*Visualization!$L$20)","v":""},{"$f":"IF(DA35=\"\",\"\",_xlfn.NUMBERVALUE(Visualization!$L$20))","v":""},{"$f":"IF(DA35=\"\",\"\",_xlfn.NUMBERVALUE(Visualization!$L$21))","v":""},"","","",{"$f":"IF(Visualization!$F$21=\"\",\"\",IF(DA35=\"\",\"\",_xlfn.NUMBERVALUE(Visualization!$F$21)))","v":""},null,null,null,null,null,null,null,null,null,null,null,"µ",{"$f":"IFERROR(EC23+EC34*(0-EC23),\"\")","v":""},null,null,null,null,null,null,null,null,null,null,"","","","","",{"$f":"IF(ER35=\"\",\"\",_xlfn.NUMBERVALUE(Visualization!$L$20))","v":""},{"$f":"IF(ER35=\"\",\"\",_xlfn.NUMBERVALUE(Visualization!$L$21))","v":""},"",{"$f":"IF(EU35=\"\",\"\",IF(Visualization!$F$21=\"\",0,Visualization!$F$21))","v":""},null,"","",null,"",null,"",null,"",null,"",null,""]
[null,null,null,null,null,null,null,null,null,null,null,null,null,null,null,null,null,null,null,null,null,null,null,null,null,null,null,null,null,null,null,null,null,null,null,null,null,null,null,null,null,null,null,null,null,null,null,null,null,null,null,null,null,null,null,null,null,null,null,null,null,null,null,null,null,null,null,{"$f":"IF(Values!C15=\"\",\"\",SMALL(Values!$D$13:$D$62,Values!C15))","v":""},{"$f":"IF(Values!D15=\"\",\"\",NORMSINV((Values!C15-0.3)/(COUNT($BP$34:$BP$83))))","v":""},null,{"$f":"IF(Visualization!F51=\"\",\"\",Visualization!F51+3*Visualization!F53)","v":""},3,null,"","",null,{"$f":"IF(DA8=\"\",\"\",EXP(((LN(LN(1/(1-BZ36))))/$BZ$44)+LN($BZ$45)))","v":""},0.99865000000000004,null,"",{"$f":"IF(BP36=\"\",\"\",_xlfn.NORM.S.INV((Values!C15-0.5)/Calculation!$DW$8))","v":""},null,{"$f":"IF(DA8=\"\",\"\",IF(_xlfn.NORM.S.INV(_xlfn.NORM.S.DIST(EC26,TRUE)+0.99865*(1-_xlfn.NORM.S.DIST(EC26,TRUE)))*EC29+EC28<0,0,_xlfn.NORM.S.INV(_xlfn.NORM.S.DIST(EC26,TRUE)+0.99865*(1-_xlfn.NORM.S.DIST(EC26,TRUE)))*EC29+EC28))","v":""},0.99865000000000004,null,"",{"$f":"IF(Values!D15=\"\",\"\",NORMSINV((Values!C15-0.3)/(COUNT($CH$34:$CH$83))))","v":""},null,{"$f":"IF(EF14=\"\",\"\",EXP(CI6)+3*EXP(EF14))","v":""},3,null,"",{"$f":"IF(BP36=\"\",\"\",LN(LN(1/(1-((Values!C15-0.5)/$EI$8)))))","v":""},null,{"$f":"IF(DA8=\"\",\"\",EXP(((LN(LN(1/(1-CR36))))/$CR$44)+LN($CR$45)))","v":""},0.99865000000000004,null,null,null,null,null,null,null,{"$f":"IF(Values!C41=\"\",\"\",CZ35+1)","v":""},{"$f":"IF(AND(Values!D41=\"\",Values!E41=\"\"),\"\",IF(Values!$E$4=\"1 Parameter\",Values!D41,SQRT(Values!D41^2+Values!E41^2)))","v":""},"",null,"","","","","",{"$f":"IF($DA$8=\"\",\"\",SIN(RADIANS(DH36))*Visualization!$L$20+0)","v":""},{"$f":"IF($DA$8=\"\",\"\",COS(RADIANS(DH36))*Visualization!$L$20)","v":""},{"$f":"IF(DA36=\"\",\"\",_xlfn.NUMBERVALUE(Visualization!$L$20))","v":""},{"$f":"IF(DA36=\"\",\"\",_xlfn.NUMBERVALUE(Visualization!$L$21))","v":""},"","","",{"$f":"IF(Visualization!$F$21=\"\",\"\",IF(DA36=\"\",\"\",_xlfn.NUMBERVALUE(Visualization!$F$21)))","v":""},null,null,null,null,null,null,null,null,null,null,null,"σ^2",{"$f":"IFERROR(EC24^2+EC34*(0-EC23)^2,\"\")","v":""},null,null,null,null,null,null,null,null,null,null,"","","","","",{"$f":"IF(ER36=\"\",\"\",_xlfn.NUMBERVALUE(Visualization!$L$20))","v":""},{"$f":"IF(ER36=\"\",\"\",_xlfn.NUMBERVALUE(Visualization!$L$21))","v":""},"",{"$f":"IF(EU36=\"\",\"\",IF(Visualization!$F$21=\"\",0,Visualization!$F$21))","v":""},null,"","",null,"",null,"",null,"",null,"",null,""]
[null,null,null,null,null,null,null,null,null,null,null,null,null,null,null,null,null,null,null,null,null,null,null,null,null,null,null,null,null,null,null,null,null,null,null,null,null,null,null,null,null,null,null,null,null,null,null,null,null,null,null,null,null,null,null,null,null,null,null,null,null,null,null,null,null,null,null,{"$f":"IF(Values!C16=\"\",\"\",SMALL(Values!$D$13:$D$62,Values!C16))","v":""},{"$f":"IF(Values!D16=\"\",\"\",NORMSINV((Values!C16-0.3)/(COUNT($BP$34:$BP$83))))","v":""},null,null,null,null,"","",null,null,null,null,"",{"$f":"IF(BP37=\"\",\"\",_xlfn.NORM.S.INV((Values!C16-0.5)/Calculation!$DW$8))","v":""},null,null,null,null,"",{"$f":"IF(Values!D16=\"\",\"\",NORMSINV((Values!C16-0.3)/(COUNT($CH$34:$CH$83))))","v":""},null,null,null,null,"",{"$f":"IF(BP37=\"\",\"\",LN(LN(1/(1-((Values!C16-0.5)/$EI$8)))))","v":""},null,null,null,null,null,null,null,null,null,null,{"$f":"IF(Values!C42=\"\",\"\",CZ36+1)","v":""},{"$f":"IF(AND(Values!D42=\"\",Values!E42=\"\"),\"\",IF(Values!$E$4=\"1 Parameter\",Values!D42,SQRT(Values!D42^2+Values!E42^2)))","v":""},"",null,"","","","","",{"$f":"IF($DA$8=\"\",\"\",SIN(RADIANS(DH37))*Visualization!$L$20+0)","v":""},{"$f":"IF($DA$8=\"\",\"\",COS(RADIANS(DH37))*Visualization!$L$20)","v":""},{"$f":"IF(DA37=\"\",\"\",_xlfn.NUMBERVALUE(Visualization!$L$20))","v":""},{"$f":"IF(DA37=\"\",\"\",_xlfn.NUMBERVALUE(Visualization!$L$21))","v":""},"","","",{"$f":"IF(Visualization!$F$21=\"\",\"\",IF(DA37=\"\",\"\",_xlfn.NUMBERVALUE(Visualization!$F$21)))","v":""},null,null,null,null,null,null,null,null,null,null,null,null,null,null,null,null,null,null,null,null,null,null,null,"","","","","",{"$f":"IF(ER37=\"\",\"\",_xlfn.NUMBERVALUE(Visualization!$L$20))","v":""},{"$f":"IF(ER37=\"\",\"\",_xlfn.NUMBERVALUE(Visualization!$L$21))","v":""},"",{"$f":"IF(EU37=\"\",\"\",IF(Visualization!$F$21=\"\",0,Visualization!$F$21))","v":""},null,"","",null,"",null,"",null,"",null,"",null,""]
[null,null,null,null,null,null,null,null,null,null,null,null,null,null,null,null,null,null,null,null,null,null,null,null,null,null,null,null,null,null,null,null,null,null,null,null,null,null,null,null,null,null,null,null,null,null,null,null,null,null,null,null,null,null,null,null,null,null,null,null,null,null,null,null,null,null,null,{"$f":"IF(Values!C17=\"\",\"\",SMALL(Values!$D$13:$D$62,Values!C17))","v":""},{"$f":"IF(Values!D17=\"\",\"\",NORMSINV((Values!C17-0.3)/(COUNT($BP$34:$BP$83))))","v":""},null,"USL",{"$f":"IF(Visualization!L20=\"\",\"\",Visualization!L20)","v":""},null,"","",null,"USL",{"$f":"IF(BT38=\"\",\"\",BT38)","v":""},null,"",{"$f":"IF(BP38=\"\",\"\",_xlfn.NORM.S.INV((Values!C17-0.5)/Calculation!$DW$8))","v":""},null,"USL",{"$f":"IF(BZ38=\"\",\"\",BZ38)","v":""},null,"",{"$f":"IF(Values!D17=\"\",\"\",NORMSINV((Values!C17-0.3)/(COUNT($CH$34:$CH$83))))","v":""},null,"USL",{"$f":"IF(BZ38=\"\",\"\",LN(BZ38))","v":""},null,"",{"$f":"IF(BP38=\"\",\"\",LN(LN(1/(1-((Values!C17-0.5)/$EI$8)))))","v":""},null,"USL",{"$f":"IF(BZ38=\"\",\"\",BZ38)","v":""},null,null,null,null,null,null,null,{"$f":"IF(Values!C43=\"\",\"\",CZ37+1)","v":""},{"$f":"IF(AND(Values!D43=\"\",Values!E43=\"\"),\"\",IF(Values!$E$4=\"1 Parameter\",Values!D43,SQRT(Values!D43^2+Values!E43^2)))","v":""},"",null,"","","","","",{"$f":"IF($DA$8=\"\",\"\",SIN(RADIANS(DH38))*Visualization!$L$20+0)","v":""},{"$f":"IF($DA$8=\"\",\"\",COS(RADIANS(DH38))*Visualization!$L$20)","v":""},{"$f":"IF(DA38=\"\",\"\",_xlfn.NUMBERVALUE(Visualization!$L$20))","v":""},{"$f":"IF(DA38=\"\",\"\",_xlfn.NUMBERVALUE(Visualization!$L$21))","v":""},"","","",{"$f":"IF(Visualization!$F$21=\"\",\"\",IF(DA38=\"\",\"\",_xlfn.NUMBERVALUE(Visualization!$F$21)))","v":""},null,null,null,null,null,null,null,null,null,null,null,null,null,null,null,null,null,null,null,null,null,null,null,"","","","","",{"$f":"IF(ER38=\"\",\"\",_xlfn.NUMBERVALUE(Visualization!$L$20))","v":""},{"$f":"IF(ER38=\"\",\"\",_xlfn.NUMBERVALUE(Visualization!$L$21))","v":""},"",{"$f":"IF(EU38=\"\",\"\",IF(Visualization!$F$21=\"\",0,Visualization!$F$21))","v":""},null,"","",null,"",null,"",null,"",null,"",null,""]
[null,null,null,null,null,null,null,null,null,null,null,null,null,null,null,null,null,null,null,null,null,null,null,null,null,null,null,null,null,null,null,null,null,null,null,null,null,null,null,null,null,null,null,null,null,null,null,null,null,null,null,null,null,null,null,null,null,null,null,null,null,null,null,null,null,null,null,{"$f":"IF(Values!C18=\"\",\"\",SMALL(Values!$D$13:$D$62,Values!C18))","v":""},{"$f":"IF(Values!D18=\"\",\"\",NORMSINV((Values!C18-0.3)/(COUNT($BP$34:$BP$83))))","v":""},null,"LSL",{"$f":"IF(Visualization!L21=\"\",\"\",Visualization!L21)","v":""},null,"","",null,"LSL",{"$f":"IF(BT39=\"\",\"\",BT39)","v":""},null,"",{"$f":"IF(BP39=\"\",\"\",_xlfn.NORM.S.INV((Values!C18-0.5)/Calculation!$DW$8))","v":""},null,"LSL",{"$f":"IF(BZ39=\"\",\"\",BZ39)","v":""},null,"",{"$f":"IF(Values!D18=\"\",\"\",NORMSINV((Values!C18-0.3)/(COUNT($CH$34:$CH$83))))","v":""},null,"LSL",{"$f":"IFERROR(IF(BZ39=\"\",\"\",LN(BZ39)),0)","v":""},null,"",{"$f":"IF(BP39=\"\",\"\",LN(LN(1/(1-((Values!C18-0.5)/$EI$8)))))","v":""},null,"LSL",{"$f":"IF(BZ39=\"\",\"\",BZ39)","v":""},null,null,null,null,null,null,null,{"$f":"IF(Values!C44=\"\",\"\",CZ38+1)","v":""},{"$f":"IF(AND(Values!D44=\"\",Values!E44=\"\"),\"\",IF(Values!$E$4=\"1 Parameter\",Values!D44,SQRT(Values!D44^2+Values!E44^2)))","v":""},"",null,"","","","","",{"$f":"IF($DA$8=\"\",\"\",SIN(RADIANS(DH39))*Visualization!$L$20+0)","v":""},{"$f":"IF($DA$8=\"\",\"\",COS(RADIANS(DH39))*Visualization!$L$20)","v":""},{"$f":"IF(DA39=\"\",\"\",_xlfn.NUMBERVALUE(Visualization!$L$20))","v":""},{"$f":"IF(DA39=\"\",\"\",_xlfn.NUMBERVALUE(Visualization!$L$21))","v":""},"","","",{"$f":"IF(Visualization!$F$21=\"\",\"\",IF(DA39=\"\",\"\",_xlfn.NUMBERVALUE(Visualization!$F$21)))","v":""},null,null,null,null,null,null,null,null,null,null,null,null,null,null,null,null,null,null,null,null,null,null,null,"","","","","",{"$f":"IF(ER39=\"\",\"\",_xlfn.NUMBERVALUE(Visualization!$L$20))","v":""},{"$f":"IF(ER39=\"\",\"\",_xlfn.NUMBERVALUE(Visualization!$L$21))","v":""},"",{"$f":"IF(EU39=\"\",\"\",IF(Visualization!$F$21=\"\",0,Visualization!$F$21))","v":""},null,"","",null,"",null,"",null,"",null,"",null,""]
[null,null,null,null,null,null,null,null,null,null,null,null,null,null,null,null,null,null,null,null,null,null,null,null,null,null,null,null,null,null,null,null,null,null,null,null,null,null,null,null,null,null,null,null,null,null,null,null,null,null,null,null,null,null,null,null,null,null,null,null,null,null,null,null,null,null,null,{"$f":"IF(Values!C19=\"\",\"\",SMALL(Values!$D$13:$D$62,Values!C19))","v":""},{"$f":"IF(Values!D19=\"\",\"\",NORMSINV((Values!C19-0.3)/(COUNT($BP$34:$BP$83))))","v":""},null,null,null,null,"","",null,null,null,null,"",{"$f":"IF(BP40=\"\",\"\",_xlfn.NORM.S.INV((Values!C19-0.5)/Calculation!$DW$8))","v":""},null,null,null,null,"",{"$f":"IF(Values!D19=\"\",\"\",NORMSINV((Values!C19-0.3)/(COUNT($CH$34:$CH$83))))","v":""},null,null,null,null,"",{"$f":"IF(BP40=\"\",\"\",LN(LN(1/(1-((Values!C19-0.5)/$EI$8)))))","v":""},null,null,null,null,null,null,null,null,null,null,{"$f":"IF(Values!C45=\"\",\"\",CZ39+1)","v":""},{"$f":"IF(AND(Values!D45=\"\",Values!E45=\"\"),\"\",IF(Values!$E$4=\"1 Parameter\",Values!D45,SQRT(Values!D45^2+Values!E45^2)))","v":""},"",null,"","","","","",{"$f":"IF($DA$8=\"\",\"\",SIN(RADIANS(DH40))*Visualization!$L$20+0)","v":""},{"$f":"IF($DA$8=\"\",\"\",COS(RADIANS(DH40))*Visualization!$L$20)","v":""},{"$f":"IF(DA40=\"\",\"\",_xlfn.NUMBERVALUE(Visualization!$L$20))","v":""},{"$f":"IF(DA40=\"\",\"\",_xlfn.NUMBERVALUE(Visualization!$L$21))","v":""},"","","",{"$f":"IF(Visualization!$F$21=\"\",\"\",IF(DA40=\"\",\"\",_xlfn.NUMBERVALUE(Visualization!$F$21)))","v":""},null,null,null,null,null,{"$f":"IF(Values!E5=\"No\",\"Pp\",\"Cm\")","v":"Cm"},{"$f":"IF(DW21<>\"none\",\"\",IF(DW8<15,\"\",DW20/(6*DW14)))","v":""},null,{"$f":"IF(Values!H5=\"No\",\"Pp\",\"Cm\")","v":"Cm"},{"$f":"IF(DZ21<>\"none\",\"\",$DZ$20/($BY$36-$BY$34))","v":""},null,{"$f":"IF(Values!R5=\"No\",\"Pp\",\"Cm\")","v":"Cm"},{"$f":"IF(EC21<>\"none\",\"\",$EC$20/($CE$36-$CE$34))","v":""},null,{"$f":"IF(Values!V5=\"No\",\"Pp\",\"Cm\")","v":"Cm"},{"$f":"IF(EF21<>\"none\",\"\",IF(EF8<15,\"\",EF20/(6*EF14)))","v":""},null,{"$f":"IF(Values!Y5=\"No\",\"Pp\",\"Cm\")","v":"Cm"},{"$f":"IF(EI21<>\"none\",\"\",$EI$20/($CQ$36-$CQ$34))","v":""},null,{"$f":"IF(Values!Z5=\"No\",\"Pp\",\"Cm\")","v":"Cm"},{"$f":"IF(EL21<>\"none\",\"\",(EL18-EL19)/(EL32-EL33))","v":""},null,"","","","","",{"$f":"IF(ER40=\"\",\"\",_xlfn.NUMBERVALUE(Visualization!$L$20))","v":""},{"$f":"IF(ER40=\"\",\"\",_xlfn.NUMBERVALUE(Visualization!$L$21))","v":""},"",{"$f":"IF(EU40=\"\",\"\",IF(Visualization!$F$21=\"\",0,Visualization!$F$21))","v":""},null,"","",null,"",null,"",null,"",null,"",null,""]
[null,null,null,null,null,null,null,null,null,null,null,null,null,null,null,null,null,null,null,null,null,null,null,null,null,null,null,null,null,null,null,null,null,null,null,null,null,null,null,null,null,null,null,null,null,null,null,null,null,null,null,null,null,null,null,null,null,null,null,null,null,null,null,null,null,null,null,{"$f":"IF(Values!C20=\"\",\"\",SMALL(Values!$D$13:$D$62,Values!C20))","v":""},{"$f":"IF(Values!D20=\"\",\"\",NORMSINV((Values!C20-0.3)/(COUNT($BP$34:$BP$83))))","v":""},null,null,null,null,"","",null,null,null,null,"",{"$f":"IF(BP41=\"\",\"\",_xlfn.NORM.S.INV((Values!C20-0.5)/Calculation!$DW$8))","v":""},null,null,null,null,"",{"$f":"IF(Values!D20=\"\",\"\",NORMSINV((Values!C20-0.3)/(COUNT($CH$34:$CH$83))))","v":""},null,null,null,null,"",{"$f":"IF(BP41=\"\",\"\",LN(LN(1/(1-((Values!C20-0.5)/$EI$8)))))","v":""},null,null,null,null,null,null,null,null,null,null,{"$f":"IF(Values!C46=\"\",\"\",CZ40+1)","v":""},{"$f":"IF(AND(Values!D46=\"\",Values!E46=\"\"),\"\",IF(Values!$E$4=\"1 Parameter\",Values!D46,SQRT(Values!D46^2+Values!E46^2)))","v":""},"",null,{"$f":"IF(DA41=\"\",\"\",MAX(DA40:DA41)-MIN(DA40:DA41))","v":""},"","","","",{"$f":"IF($DA$8=\"\",\"\",SIN(RADIANS(DH41))*Visualization!$L$20+0)","v":""},{"$f":"IF($DA$8=\"\",\"\",COS(RADIANS(DH41))*Visualization!$L$20)","v":""},{"$f":"IF(DA41=\"\",\"\",_xlfn.NUMBERVALUE(Visualization!$L$20))","v":""},{"$f":"IF(DA41=\"\",\"\",_xlfn.NUMBERVALUE(Visualization!$L$21))","v":""},"","","",{"$f":"IF(Visualization!$F$21=\"\",\"\",IF(DA41=\"\",\"\",_xlfn.NUMBERVALUE(Visualization!$F$21)))","v":""},null,null,null,null,null,{"$f":"IF(Values!E5=\"No\",\"Ppk USL\",\"Cmk USL\")","v":"Cmk USL"},{"$f":"IF(DW21=\"Only LSL is specified\",\"\",(DW18-BQ6)/(3*DW14))","v":{"$error":"#VALUE!"}},null,{"$f":"IF(Values!H5=\"No\",\"Ppk USL\",\"Cmk USL\")","v":"Cmk USL"},{"$f":"IF(DZ21=\"Only LSL is specified\",\"\",($DZ$18-$BY$35)/($BY$36-$BY$35))","v":{"$error":"#VALUE!"}},null,{"$f":"IF(Values!R5=\"No\",\"Ppk USL\",\"Cmk USL\")","v":"Cmk USL"},{"$f":"IF(EC21=\"Only LSL is specified\",\"\",($EC$18-$CE$35)/($CE$36-$CE$35))","v":{"$error":"#VALUE!"}},null,{"$f":"IF(Values!V5=\"No\",\"Ppk USL\",\"Cmk USL\")","v":"Cmk USL"},{"$f":"IF(EF21=\"Only LSL is specified\",\"\",(EF18-CI6)/(3*EF14))","v":{"$error":"#VALUE!"}},null,{"$f":"IF(Values!Y5=\"No\",\"Ppk USL\",\"Cmk USL\")","v":"Cmk USL"},{"$f":"IF(EI21=\"Only LSL is specified\",\"\",($EI$18-$CQ$35)/($CQ$36-$CQ$35))","v":{"$error":"#VALUE!"}},null,{"$f":"IF(Values!Z5=\"No\",\"Ppk USL\",\"Cmk USL\")","v":"Cmk USL"},{"$f":"IF(EL21=\"Only LSL is specified\",\"\",(EL18-EL27)/(EL32-EL27))","v":{"$error":"#VALUE!"}},null,"","","","","",{"$f":"IF(ER41=\"\",\"\",_xlfn.NUMBERVALUE(Visualization!$L$20))","v":""},{"$f":"IF(ER41=\"\",\"\",_xlfn.NUMBERVALUE(Visualization!$L$21))","v":""},"",{"$f":"IF(EU41=\"\",\"\",IF(Visualization!$F$21=\"\",0,Visualization!$F$21))","v":""},null,"","",null,"",null,"",null,"",null,"",null,""]
[null,null,null,null,null,null,null,null,null,null,null,null,null,null,null,null,null,null,null,null,null,null,null,null,null,null,null,null,null,null,null,null,null,null,null,null,null,null,null,null,null,null,null,null,null,null,null,null,null,null,null,null,null,null,null,null,null,null,null,null,null,null,null,null,null,null,null,{"$f":"IF(Values!C21=\"\",\"\",SMALL(Values!$D$13:$D$62,Values!C21))","v":""},{"$f":"IF(Values!D21=\"\",\"\",NORMSINV((Values!C21-0.3)/(COUNT($BP$34:$BP$83))))","v":""},null,null,null,null,"","",null,"intercept",{"$f":"CR42","v":""},null,"",{"$f":"IF(BP42=\"\",\"\",_xlfn.NORM.S.INV((Values!C21-0.5)/Calculation!$DW$8))","v":""},null,null,null,null,"",{"$f":"IF(Values!D21=\"\",\"\",NORMSINV((Values!C21-0.3)/(COUNT($CH$34:$CH$83))))","v":""},null,null,null,null,"",{"$f":"IF(BP42=\"\",\"\",LN(LN(1/(1-((Values!C21-0.5)/$EI$8)))))","v":""},null,"intercept",{"$f":"IF(CN34=\"\",\"\",INTERCEPT(CN34:CN83,CO34:CO83))","v":""},null,null,null,null,null,null,null,{"$f":"IF(Values!C47=\"\",\"\",CZ41+1)","v":""},{"$f":"IF(AND(Values!D47=\"\",Values!E47=\"\"),\"\",IF(Values!$E$4=\"1 Parameter\",Values!D47,SQRT(Values!D47^2+Values!E47^2)))","v":""},"",null,"","","","","",{"$f":"IF($DA$8=\"\",\"\",SIN(RADIANS(DH42))*Visualization!$L$20+0)","v":""},{"$f":"IF($DA$8=\"\",\"\",COS(RADIANS(DH42))*Visualization!$L$20)","v":""},{"$f":"IF(DA42=\"\",\"\",_xlfn.NUMBERVALUE(Visualization!$L$20))","v":""},{"$f":"IF(DA42=\"\",\"\",_xlfn.NUMBERVALUE(Visualization!$L$21))","v":""},"","","",{"$f":"IF(Visualization!$F$21=\"\",\"\",IF(DA42=\"\",\"\",_xlfn.NUMBERVALUE(Visualization!$F$21)))","v":""},null,null,null,null,null,{"$f":"IF(Values!E5=\"No\",\"Ppk LSL\",\"Cmk LSL\")","v":"Cmk LSL"},{"$f":"IF(DW21=\"Only USL is specified\",\"\",(BQ6-DW19)/(3*DW14))","v":{"$error":"#VALUE!"}},null,{"$f":"IF(Values!H5=\"No\",\"Ppk LSL\",\"Cmk LSL\")","v":"Cmk LSL"},{"$f":"IF(DZ21=\"Only USL is specified\",\"\",($DZ$19-$BY$35)/($BY$35-$BY$34))","v":{"$error":"#VALUE!"}},null,{"$f":"IF(Values!R5=\"No\",\"Ppk LSL\",\"Cmk LSL\")","v":"Cmk LSL"},{"$f":"IF(EC21=\"Only USL is specified\",\"\",($EC$19-$CE$35)/($CE$35-$CE$34))","v":{"$error":"#VALUE!"}},null,{"$f":"IF(Values!V5=\"No\",\"Ppk LSL\",\"Cmk LSL\")","v":"Cmk LSL"},{"$f":"IF(EF21=\"Only USL is specified\",\"\",(CI6-EF19)/(3*EF14))","v":{"$error":"#VALUE!"}},null,{"$f":"IF(Values!Y5=\"No\",\"Ppk LSL\",\"Cmk LSL\")","v":"Cmk LSL"},{"$f":"IF(EI21=\"Only USL is specified\",\"\",($CQ$35-$EI$19)/($CQ$35-$CQ$34))","v":{"$error":"#VALUE!"}},null,{"$f":"IF(Values!Z5=\"No\",\"Ppk LSL\",\"Cmk LSL\")","v":"Cmk LSL"},{"$f":"IF(EL21=\"Only USL is specified\",\"\",(EL27-EL19)/(EL27-EL33))","v":{"$error":"#VALUE!"}},null,"","","","","",{"$f":"IF(ER42=\"\",\"\",_xlfn.NUMBERVALUE(Visualization!$L$20))","v":""},{"$f":"IF(ER42=\"\",\"\",_xlfn.NUMBERVALUE(Visualization!$L$21))","v":""},"",{"$f":"IF(EU42=\"\",\"\",IF(Visualization!$F$21=\"\",0,Visualization!$F$21))","v":""},null,"","",null,"",null,"",null,"",null,"",null,""]
[null,null,null,null,null,null,null,null,null,null,null,null,null,null,null,null,null,null,null,null,null,null,null,null,null,null,null,null,null,null,null,null,null,null,null,null,null,null,null,null,null,null,null,null,null,null,null,null,null,null,null,null,null,null,null,null,null,null,null,null,null,null,null,null,null,null,null,{"$f":"IF(Values!C22=\"\",\"\",SMALL(Values!$D$13:$D$62,Values!C22))","v":""},{"$f":"IF(Values!D22=\"\",\"\",NORMSINV((Values!C22-0.3)/(COUNT($BP$34:$BP$83))))","v":""},null,null,null,null,"","",null,"Slope",{"$f":"CR43","v":""},null,"",{"$f":"IF(BP43=\"\",\"\",_xlfn.NORM.S.INV((Values!C22-0.5)/Calculation!$DW$8))","v":""},null,null,null,null,"",{"$f":"IF(Values!D22=\"\",\"\",NORMSINV((Values!C22-0.3)/(COUNT($CH$34:$CH$83))))","v":""},null,null,null,null,"",{"$f":"IF(BP43=\"\",\"\",LN(LN(1/(1-((Values!C22-0.5)/$EI$8)))))","v":""},null,"Slope",{"$f":"IF(CN34=\"\",\"\",SLOPE(CN34:CN83,CO34:CO83))","v":""},null,null,null,null,null,null,null,{"$f":"IF(Values!C48=\"\",\"\",CZ42+1)","v":""},{"$f":"IF(AND(Values!D48=\"\",Values!E48=\"\"),\"\",IF(Values!$E$4=\"1 Parameter\",Values!D48,SQRT(Values!D48^2+Values!E48^2)))","v":""},"",null,"","","","","",{"$f":"IF($DA$8=\"\",\"\",SIN(RADIANS(DH43))*Visualization!$L$20+0)","v":""},{"$f":"IF($DA$8=\"\",\"\",COS(RADIANS(DH43))*Visualization!$L$20)","v":""},{"$f":"IF(DA43=\"\",\"\",_xlfn.NUMBERVALUE(Visualization!$L$20))","v":""},{"$f":"IF(DA43=\"\",\"\",_xlfn.NUMBERVALUE(Visualization!$L$21))","v":""},"","","",{"$f":"IF(Visualization!$F$21=\"\",\"\",IF(DA43=\"\",\"\",_xlfn.NUMBERVALUE(Visualization!$F$21)))","v":""},null,null,null,null,null,{"$f":"IF(Values!E5=\"No\",\"Ppk\",\"Cmk\")","v":"Cmk"},{"$f":"MIN(DW41:DW42)","v":{"$error":"#VALUE!"}},null,{"$f":"IF(Values!H5=\"No\",\"Ppk\",\"Cmk\")","v":"Cmk"},{"$f":"MIN(DZ41:DZ42)","v":{"$error":"#VALUE!"}},null,{"$f":"IF(Values!R5=\"No\",\"Ppk\",\"Cmk\")","v":"Cmk"},{"$f":"MIN(EC41:EC42)","v":{"$error":"#VALUE!"}},null,{"$f":"IF(Values!V5=\"No\",\"Ppk\",\"Cmk\")","v":"Cmk"},{"$f":"MIN(EF41:EF42)","v":{"$error":"#VALUE!"}},null,{"$f":"IF(Values!Y5=\"No\",\"Ppk\",\"Cmk\")","v":"Cmk"},{"$f":"MIN(EI41:EI42)","v":{"$error":"#VALUE!"}},null,{"$f":"IF(Values!Z5=\"No\",\"Ppk\",\"Cmk\")","v":"Cmk"},{"$f":"MIN(EL41:EL42)","v":{"$error":"#VALUE!"}},null,"","","","","",{"$f":"IF(ER43=\"\",\"\",_xlfn.NUMBERVALUE(Visualization!$L$20))","v":""},{"$f":"IF(ER43=\"\",\"\",_xlfn.NUMBERVALUE(Visualization!$L$21))","v":""},"",{"$f":"IF(EU43=\"\",\"\",IF(Visualization!$F$21=\"\",0,Visualization!$F$21))","v":""},null,"","",null,"",null,"",null,"",null,"",null,""]
[null,null,null,null,null,null,null,null,null,null,null,null,null,null,null,null,null,null,null,null,null,null,null,null,null,null,null,null,null,null,null,null,null,null,null,null,null,null,null,null,null,null,null,null,null,null,null,null,null,null,null,null,null,null,null,null,null,null,null,null,null,null,null,null,null,null,null,{"$f":"IF(Values!C23=\"\",\"\",SMALL(Values!$D$13:$D$62,Values!C23))","v":""},{"$f":"IF(Values!D23=\"\",\"\",NORMSINV((Values!C23-0.3)/(COUNT($BP$34:$BP$83))))","v":""},null,null,null,null,"","",null,"b",2,null,"",{"$f":"IF(BP44=\"\",\"\",_xlfn.NORM.S.INV((Values!C23-0.5)/Calculation!$DW$8))","v":""},null,null,null,null,"",{"$f":"IF(Values!D23=\"\",\"\",NORMSINV((Values!C23-0.3)/(COUNT($CH$34:$CH$83))))","v":""},null,null,null,null,"",{"$f":"IF(BP44=\"\",\"\",LN(LN(1/(1-((Values!C23-0.5)/$EI$8)))))","v":""},null,"b",{"$f":"IF(CR43=\"\",\"\",1/CR43)","v":""},null,null,null,null,null,null,null,{"$f":"IF(Values!C49=\"\",\"\",CZ43+1)","v":""},{"$f":"IF(AND(Values!D49=\"\",Values!E49=\"\"),\"\",IF(Values!$E$4=\"1 Parameter\",Values!D49,SQRT(Values!D49^2+Values!E49^2)))","v":""},"",null,"","","","","",{"$f":"IF($DA$8=\"\",\"\",SIN(RADIANS(DH44))*Visualization!$L$20+0)","v":""},{"$f":"IF($DA$8=\"\",\"\",COS(RADIANS(DH44))*Visualization!$L$20)","v":""},{"$f":"IF(DA44=\"\",\"\",_xlfn.NUMBERVALUE(Visualization!$L$20))","v":""},{"$f":"IF(DA44=\"\",\"\",_xlfn.NUMBERVALUE(Visualization!$L$21))","v":""},"","","",{"$f":"IF(Visualization!$F$21=\"\",\"\",IF(DA44=\"\",\"\",_xlfn.NUMBERVALUE(Visualization!$F$21)))","v":""},null,null,null,null,null,null,null,null,null,null,null,null,null,null,null,null,null,null,null,null,null,null,null,"","","","","",{"$f":"IF(ER44=\"\",\"\",_xlfn.NUMBERVALUE(Visualization!$L$20))","v":""},{"$f":"IF(ER44=\"\",\"\",_xlfn.NUMBERVALUE(Visualization!$L$21))","v":""},"",{"$f":"IF(EU44=\"\",\"\",IF(Visualization!$F$21=\"\",0,Visualization!$F$21))","v":""},null,"","",null,"",null,"",null,"",null,"",null,""]
[null,null,null,null,null,null,null,null,"Values are normal distributed",null,"Unvalued",null,null,"A graphical valuation is part of determining a distribution. The User do have the possibility to influence the calculated result.",null,null,null,null,null,"Values are normal distributed",null,"Unvalued",null,null,"A graphical valuation is part of determining a distribution. The User do have the possibility to influence the calculated result.",null,null,null,null,null,"Values are normal distributed",null,"Unvalued",null,null,"A graphical valuation is part of determining a distribution. The User do have the possibility to influence the calculated result.",null,null,null,null,"Values are normal distributed",null,"Unvalued",null,null,"A graphical valuation is part of determining a distribution. The User do have the possibility to influence the calculated result.",null,null,null,null,"Values are normal distributed",null,"Unvalued",null,null,"A graphical valuation is part of determining a distribution. The User do have the possibility to influence the calculated result.",null,null,null,null,null,null,null,null,null,null,null,{"$f":"IF(Values!C24=\"\",\"\",SMALL(Values!$D$13:$D$62,Values!C24))","v":""},{"$f":"IF(Values!D24=\"\",\"\",NORMSINV((Values!C24-0.3)/(COUNT($BP$34:$BP$83))))","v":""},null,null,null,null,"","",null,"a",{"$f":"CR45","v":""},null,"",{"$f":"IF(BP45=\"\",\"\",_xlfn.NORM.S.INV((Values!C24-0.5)/Calculation!$DW$8))","v":""},null,null,null,null,"",{"$f":"IF(Values!D24=\"\",\"\",NORMSINV((Values!C24-0.3)/(COUNT($CH$34:$CH$83))))","v":""},null,null,null,null,"",{"$f":"IF(BP45=\"\",\"\",LN(LN(1/(1-((Values!C24-0.5)/$EI$8)))))","v":""},null,"a",{"$f":"IF(CR42=\"\",\"\",EXP(CR42))","v":""},null,null,null,null,null,null,null,{"$f":"IF(Values!C50=\"\",\"\",CZ44+1)","v":""},{"$f":"IF(AND(Values!D50=\"\",Values!E50=\"\"),\"\",IF(Values!$E$4=\"1 Parameter\",Values!D50,SQRT(Values!D50^2+Values!E50^2)))","v":""},"",null,"","","","","",{"$f":"IF($DA$8=\"\",\"\",SIN(RADIANS(DH45))*Visualization!$L$20+0)","v":""},{"$f":"IF($DA$8=\"\",\"\",COS(RADIANS(DH45))*Visualization!$L$20)","v":""},{"$f":"IF(DA45=\"\",\"\",_xlfn.NUMBERVALUE(Visualization!$L$20))","v":""},{"$f":"IF(DA45=\"\",\"\",_xlfn.NUMBERVALUE(Visualization!$L$21))","v":""},"","","",{"$f":"IF(Visualization!$F$21=\"\",\"\",IF(DA45=\"\",\"\",_xlfn.NUMBERVALUE(Visualization!$F$21)))","v":""},null,null,null,null,null,null,null,null,null,null,null,null,null,null,null,null,null,null,null,null,null,null,null,"","","","","",{"$f":"IF(ER45=\"\",\"\",_xlfn.NUMBERVALUE(Visualization!$L$20))","v":""},{"$f":"IF(ER45=\"\",\"\",_xlfn.NUMBERVALUE(Visualization!$L$21))","v":""},"",{"$f":"IF(EU45=\"\",\"\",IF(Visualization!$F$21=\"\",0,Visualization!$F$21))","v":""},null,"","",null,"",null,"",null,"",null,"",null,""]
[null,null,null,null,null,null,null,null,null,null,null,null,null,null,null,null,null,null,null,null,null,null,null,null,null,null,null,null,null,null,null,null,null,null,null,null,null,null,null,null,null,null,null,null,null,null,null,null,null,null,null,null,null,null,null,null,null,null,null,null,null,null,null,null,null,null,null,{"$f":"IF(Values!C25=\"\",\"\",SMALL(Values!$D$13:$D$62,Values!C25))","v":""},{"$f":"IF(Values!D25=\"\",\"\",NORMSINV((Values!C25-0.3)/(COUNT($BP$34:$BP$83))))","v":""},null,null,null,null,"","",null,"H",{"$f":"CR47","v":0},null,"",{"$f":"IF(BP46=\"\",\"\",_xlfn.NORM.S.INV((Values!C25-0.5)/Calculation!$DW$8))","v":""},null,null,null,null,"",{"$f":"IF(Values!D25=\"\",\"\",NORMSINV((Values!C25-0.3)/(COUNT($CH$34:$CH$83))))","v":""},null,null,null,null,"",{"$f":"IF(BP46=\"\",\"\",LN(LN(1/(1-((Values!C25-0.5)/$EI$8)))))","v":""},null,"T",{"$f":"IF(CR43=\"\",\"\",EXP(1^-(CR43/CR44)))","v":""},null,null,null,null,null,null,null,{"$f":"IF(Values!C51=\"\",\"\",CZ45+1)","v":""},{"$f":"IF(AND(Values!D51=\"\",Values!E51=\"\"),\"\",IF(Values!$E$4=\"1 Parameter\",Values!D51,SQRT(Values!D51^2+Values!E51^2)))","v":""},"",null,"","","","","",{"$f":"IF($DA$8=\"\",\"\",SIN(RADIANS(DH46))*Visualization!$L$20+0)","v":""},{"$f":"IF($DA$8=\"\",\"\",COS(RADIANS(DH46))*Visualization!$L$20)","v":""},{"$f":"IF(DA46=\"\",\"\",_xlfn.NUMBERVALUE(Visualization!$L$20))","v":""},{"$f":"IF(DA46=\"\",\"\",_xlfn.NUMBERVALUE(Visualization!$L$21))","v":""},"","","",{"$f":"IF(Visualization!$F$21=\"\",\"\",IF(DA46=\"\",\"\",_xlfn.NUMBERVALUE(Visualization!$F$21)))","v":""},null,null,null,null,null,null,null,null,null,null,null,null,null,null,null,null,null,null,null,null,null,null,null,"","","","","",{"$f":"IF(ER46=\"\",\"\",_xlfn.NUMBERVALUE(Visualization!$L$20))","v":""},{"$f":"IF(ER46=\"\",\"\",_xlfn.NUMBERVALUE(Visualization!$L$21))","v":""},"",{"$f":"IF(EU46=\"\",\"\",IF(Visualization!$F$21=\"\",0,Visualization!$F$21))","v":""},null,"","",null,"",null,"",null,"",null,"",null,""]
[null,null,null,null,null,null,null,null,null,null,null,null,null,null,null,null,null,null,null,null,null,null,null,null,null,null,null,null,null,null,null,null,null,null,null,null,null,null,null,null,null,null,null,null,null,null,null,null,null,null,null,null,null,null,null,null,null,null,null,null,null,null,null,null,null,null,null,{"$f":"IF(Values!C26=\"\",\"\",SMALL(Values!$D$13:$D$62,Values!C26))","v":""},{"$f":"IF(Values!D26=\"\",\"\",NORMSINV((Values!C26-0.3)/(COUNT($BP$34:$BP$83))))","v":""},null,null,null,null,"","",null,null,null,null,"",{"$f":"IF(BP47=\"\",\"\",_xlfn.NORM.S.INV((Values!C26-0.5)/Calculation!$DW$8))","v":""},null,null,null,null,"",{"$f":"IF(Values!D26=\"\",\"\",NORMSINV((Values!C26-0.3)/(COUNT($CH$34:$CH$83))))","v":""},null,null,null,null,"",{"$f":"IF(BP47=\"\",\"\",LN(LN(1/(1-((Values!C26-0.5)/$EI$8)))))","v":""},null,null,null,null,null,null,null,null,null,null,{"$f":"IF(Values!C52=\"\",\"\",CZ46+1)","v":""},{"$f":"IF(AND(Values!D52=\"\",Values!E52=\"\"),\"\",IF(Values!$E$4=\"1 Parameter\",Values!D52,SQRT(Values!D52^2+Values!E52^2)))","v":""},"",null,"","","","","",{"$f":"IF($DA$8=\"\",\"\",SIN(RADIANS(DH47))*Visualization!$L$20+0)","v":""},{"$f":"IF($DA$8=\"\",\"\",COS(RADIANS(DH47))*Visualization!$L$20)","v":""},{"$f":"IF(DA47=\"\",\"\",_xlfn.NUMBERVALUE(Visualization!$L$20))","v":""},{"$f":"IF(DA47=\"\",\"\",_xlfn.NUMBERVALUE(Visualization!$L$21))","v":""},"","","",{"$f":"IF(Visualization!$F$21=\"\",\"\",IF(DA47=\"\",\"\",_xlfn.NUMBERVALUE(Visualization!$F$21)))","v":""},null,null,null,null,null,"thousand (ppt)",{"$f":"IF(DW43=\"\",\"\",ROUND(IF(DW43=\"\",\"\",(1-NORMDIST(DW43*3,0,1,1))*1000),2))","v":{"$error":"#VALUE!"}},null,"thousand (ppt)",{"$f":"2*((($DZ$18-$EI$10)/$CR$45)^(2-1)*EXP(-($DZ$18-$EI$10)/$CR$45)^2/$CR$45)*1000","v":{"$error":"#VALUE!"}},null,"thousand (ppt)",{"$f":"((EXP(-(((($EC$18-$EC$28)/$EC$29)^2)/2))+EXP(-(((($EC$18+$EC$28)/$EC$29)^2)/2)))/($EC$29*SQRT(2*PI())))*1000","v":{"$error":"#VALUE!"}},null,"thousand (ppt)",{"$f":"IF(EF43=\"\",\"\",ROUND(IF(EF43=\"\",\"\",(1-NORMDIST(EF43*3,0,1,1))*1000),2))","v":{"$error":"#VALUE!"}},null,"thousand (ppt)",{"$f":"2*((($DZ$18-$EI$10)/$CR$45)^(2-1)*EXP(-($DZ$18-$EI$10)/$CR$45)^$CR$44/$CR$45)*1000","v":{"$error":"#VALUE!"}},null,null,null,1.67,"","","","","",{"$f":"IF(ER47=\"\",\"\",_xlfn.NUMBERVALUE(Visualization!$L$20))","v":""},{"$f":"IF(ER47=\"\",\"\",_xlfn.NUMBERVALUE(Visualization!$L$21))","v":""},"",{"$f":"IF(EU47=\"\",\"\",IF(Visualization!$F$21=\"\",0,Visualization!$F$21))","v":""},null,"","",null,"",null,"",null,"",null,"",null,""]
[null,null,null,null,null,null,null,null,null,null,null,null,null,null,null,null,null,null,null,null,null,null,null,null,null,null,null,null,null,null,null,null,null,null,null,null,null,null,null,null,null,null,null,null,null,null,null,null,null,null,null,null,null,null,null,null,null,null,null,null,null,null,null,null,null,null,null,{"$f":"IF(Values!C27=\"\",\"\",SMALL(Values!$D$13:$D$62,Values!C27))","v":""},{"$f":"IF(Values!D27=\"\",\"\",NORMSINV((Values!C27-0.3)/(COUNT($BP$34:$BP$83))))","v":""},null,null,null,null,"","",null,null,null,null,"",{"$f":"IF(BP48=\"\",\"\",_xlfn.NORM.S.INV((Values!C27-0.5)/Calculation!$DW$8))","v":""},null,null,null,null,"",{"$f":"IF(Values!D27=\"\",\"\",NORMSINV((Values!C27-0.3)/(COUNT($CH$34:$CH$83))))","v":""},null,null,null,null,"",{"$f":"IF(BP48=\"\",\"\",LN(LN(1/(1-((Values!C27-0.5)/$EI$8)))))","v":""},null,null,null,null,null,null,null,null,null,null,{"$f":"IF(Values!C53=\"\",\"\",CZ47+1)","v":""},{"$f":"IF(AND(Values!D53=\"\",Values!E53=\"\"),\"\",IF(Values!$E$4=\"1 Parameter\",Values!D53,SQRT(Values!D53^2+Values!E53^2)))","v":""},"",null,"","","","","",{"$f":"IF($DA$8=\"\",\"\",SIN(RADIANS(DH48))*Visualization!$L$20+0)","v":""},{"$f":"IF($DA$8=\"\",\"\",COS(RADIANS(DH48))*Visualization!$L$20)","v":""},{"$f":"IF(DA48=\"\",\"\",_xlfn.NUMBERVALUE(Visualization!$L$20))","v":""},{"$f":"IF(DA48=\"\",\"\",_xlfn.NUMBERVALUE(Visualization!$L$21))","v":""},"","","",{"$f":"IF(Visualization!$F$21=\"\",\"\",IF(DA48=\"\",\"\",_xlfn.NUMBERVALUE(Visualization!$F$21)))","v":""},null,null,null,null,null,"million (ppm)",{"$f":"IF(DW43=\"\",\"\",ROUND(IF(DW43=\"\",\"\",(1-NORMDIST(DW43*3,0,1,1))*1000000),2))","v":{"$error":"#VALUE!"}},null,"million (ppm)",{"$f":"2*((($DZ$18-$EI$10)/$CR$45)^(2-1)*EXP(-($DZ$18-$EI$10)/$CR$45)^2/$CR$45)*1000000","v":{"$error":"#VALUE!"}},null,"million (ppm)",{"$f":"((EXP(-(((($EC$18-$EC$28)/$EC$29)^2)/2))+EXP(-(((($EC$18+$EC$28)/$EC$29)^2)/2)))/($EC$29*SQRT(2*PI())))*1000000","v":{"$error":"#VALUE!"}},null,"million (ppm)",{"$f":"IF(EF43=\"\",\"\",ROUND(IF(EF43=\"\",\"\",(1-NORMDIST(EF43*3,0,1,1))*1000000),2))","v":{"$error":"#VALUE!"}},null,"million (ppm)",{"$f":"2*((($DZ$18-$EI$10)/$CR$45)^(2-1)*EXP(-($DZ$18-$EI$10)/$CR$45)^$CR$44/$CR$45)*1000000","v":{"$error":"#VALUE!"}},null,null,null,2,"","","","","",{"$f":"IF(ER48=\"\",\"\",_xlfn.NUMBERVALUE(Visualization!$L$20))","v":""},{"$f":"IF(ER48=\"\",\"\",_xlfn.NUMBERVALUE(Visualization!$L$21))","v":""},"",{"$f":"IF(EU48=\"\",\"\",IF(Visualization!$F$21=\"\",0,Visualization!$F$21))","v":""},null,"","",null,"",null,"",null,"",null,"",null,""]
[null,null,null,null,null,null,null,null,null,null,null,null,null,null,null,null,null,null,null,null,null,null,null,null,null,null,null,null,null,null,null,null,null,null,null,null,null,null,null,null,null,null,null,null,null,null,null,null,null,null,null,null,null,null,null,null,null,null,null,null,null,null,null,null,null,null,null,{"$f":"IF(Values!C28=\"\",\"\",SMALL(Values!$D$13:$D$62,Values!C28))","v":""},{"$f":"IF(Values!D28=\"\",\"\",NORMSINV((Values!C28-0.3)/(COUNT($BP$34:$BP$83))))","v":""},null,null,null,null,"","",null,null,null,null,"",{"$f":"IF(BP49=\"\",\"\",_xlfn.NORM.S.INV((Values!C28-0.5)/Calculation!$DW$8))","v":""},null,null,null,null,"",{"$f":"IF(Values!D28=\"\",\"\",NORMSINV((Values!C28-0.3)/(COUNT($CH$34:$CH$83))))","v":""},null,null,null,null,"",{"$f":"IF(BP49=\"\",\"\",LN(LN(1/(1-((Values!C28-0.5)/$EI$8)))))","v":""},null,null,null,null,null,null,null,null,null,null,{"$f":"IF(Values!C54=\"\",\"\",CZ48+1)","v":""},{"$f":"IF(AND(Values!D54=\"\",Values!E54=\"\"),\"\",IF(Values!$E$4=\"1 Parameter\",Values!D54,SQRT(Values!D54^2+Values!E54^2)))","v":""},"",null,"","","","","",{"$f":"IF($DA$8=\"\",\"\",SIN(RADIANS(DH49))*Visualization!$L$20+0)","v":""},{"$f":"IF($DA$8=\"\",\"\",COS(RADIANS(DH49))*Visualization!$L$20)","v":""},{"$f":"IF(DA49=\"\",\"\",_xlfn.NUMBERVALUE(Visualization!$L$20))","v":""},{"$f":"IF(DA49=\"\",\"\",_xlfn.NUMBERVALUE(Visualization!$L$21))","v":""},"","","",{"$f":"IF(Visualization!$F$21=\"\",\"\",IF(DA49=\"\",\"\",_xlfn.NUMBERVALUE(Visualization!$F$21)))","v":""},null,null,null,null,null,"billion (ppb)",{"$f":"IF(DW43=\"\",\"\",ROUND(IF(DW43=\"\",\"\",(1-NORMDIST(DW43*3,0,1,1))*1000000000),2))","v":{"$error":"#VALUE!"}},null,"billion (ppb)",{"$f":"2*((($DZ$18-$EI$10)/$CR$45)^(2-1)*EXP(-($DZ$18-$EI$10)/$CR$45)^2/$CR$45)*1000000000","v":{"$error":"#VALUE!"}},null,"billion (ppb)",{"$f":"((EXP(-(((($EC$18-$EC$28)/$EC$29)^2)/2))+EXP(-(((($EC$18+$EC$28)/$EC$29)^2)/2)))/($EC$29*SQRT(2*PI())))*1000000000","v":{"$error":"#VALUE!"}},null,"billion (ppb)",{"$f":"IF(EF43=\"\",\"\",ROUND(IF(EF43=\"\",\"\",(1-NORMDIST(EF43*3,0,1,1))*1000000000),2))","v":{"$error":"#VALUE!"}},null,"billion (ppb)",{"$f":"2*((($DZ$18-$EI$10)/$CR$45)^(2-1)*EXP(-($DZ$18-$EI$10)/$CR$45)^$CR$44/$CR$45)*1000000000","v":{"$error":"#VALUE!"}},null,null,null,null,"","","","","",{"$f":"IF(ER49=\"\",\"\",_xlfn.NUMBERVALUE(Visualization!$L$20))","v":""},{"$f":"IF(ER49=\"\",\"\",_xlfn.NUMBERVALUE(Visualization!$L$21))","v":""},"",{"$f":"IF(EU49=\"\",\"\",IF(Visualization!$F$21=\"\",0,Visualization!$F$21))","v":""},null,"","",null,"",null,"",null,"",null,"",null,""]
[null,null,null,null,null,null,null,null,null,null,null,null,null,null,null,null,null,null,null,null,null,null,null,null,null,null,null,null,null,null,null,null,null,null,null,null,null,null,null,null,null,null,null,null,null,null,null,null,null,null,null,null,null,null,null,null,null,null,null,null,null,null,null,null,null,null,null,{"$f":"IF(Values!C29=\"\",\"\",SMALL(Values!$D$13:$D$62,Values!C29))","v":""},{"$f":"IF(Values!D29=\"\",\"\",NORMSINV((Values!C29-0.3)/(COUNT($BP$34:$BP$83))))","v":""},null,null,null,null,"","",null,null,null,null,"",{"$f":"IF(BP50=\"\",\"\",_xlfn.NORM.S.INV((Values!C29-0.5)/Calculation!$DW$8))","v":""},null,null,null,null,"",{"$f":"IF(Values!D29=\"\",\"\",NORMSINV((Values!C29-0.3)/(COUNT($CH$34:$CH$83))))","v":""},null,null,null,null,"",{"$f":"IF(BP50=\"\",\"\",LN(LN(1/(1-((Values!C29-0.5)/$EI$8)))))","v":""},null,null,null,null,null,null,null,null,null,null,{"$f":"IF(Values!C55=\"\",\"\",CZ49+1)","v":""},{"$f":"IF(AND(Values!D55=\"\",Values!E55=\"\"),\"\",IF(Values!$E$4=\"1 Parameter\",Values!D55,SQRT(Values!D55^2+Values!E55^2)))","v":""},"",null,"","","","","",{"$f":"IF($DA$8=\"\",\"\",SIN(RADIANS(DH50))*Visualization!$L$20+0)","v":""},{"$f":"IF($DA$8=\"\",\"\",COS(RADIANS(DH50))*Visualization!$L$20)","v":""},{"$f":"IF(DA50=\"\",\"\",_xlfn.NUMBERVALUE(Visualization!$L$20))","v":""},{"$f":"IF(DA50=\"\",\"\",_xlfn.NUMBERVALUE(Visualization!$L$21))","v":""},"","","",{"$f":"IF(Visualization!$F$21=\"\",\"\",IF(DA50=\"\",\"\",_xlfn.NUMBERVALUE(Visualization!$F$21)))","v":""},null,null,null,null,null,"Info:",{"$f":"IF(DW48<0.01,\"ppm is smaller then 0.01\",\"\")","v":{"$error":"#VALUE!"}}]
[null,null,null,null,null,null,null,null,null,null,null,null,null,null,null,null,null,null,null,null,null,null,null,null,null,null,null,null,null,null,null,null,null,null,null,null,null,null,null,null,"Test value (AD)",null,null,null,null,null,null,null,null,null,"P-Value",null,null,null,null,null,null,null,null,null,null,null,null,null,null,null,null,{"$f":"IF(Values!C30=\"\",\"\",SMALL(Values!$D$13:$D$62,Values!C30))","v":""},{"$f":"IF(Values!D30=\"\",\"\",NORMSINV((Values!C30-0.3)/(COUNT($BP$34:$BP$83))))","v":""},null,null,null,null,"","",null,null,null,null,"",{"$f":"IF(BP51=\"\",\"\",_xlfn.NORM.S.INV((Values!C30-0.5)/Calculation!$DW$8))","v":""},null,null,null,null,"",{"$f":"IF(Values!D30=\"\",\"\",NORMSINV((Values!C30-0.3)/(COUNT($CH$34:$CH$83))))","v":""},null,null,null,null,"",{"$f":"IF(BP51=\"\",\"\",LN(LN(1/(1-((Values!C30-0.5)/$EI$8)))))","v":""},null,null,null,null,null,null,null,null,null,null,{"$f":"IF(Values!C56=\"\",\"\",CZ50+1)","v":""},{"$f":"IF(AND(Values!D56=\"\",Values!E56=\"\"),\"\",IF(Values!$E$4=\"1 Parameter\",Values!D56,SQRT(Values!D56^2+Values!E56^2)))","v":""},"",null,"","","","","",{"$f":"IF($DA$8=\"\",\"\",SIN(RADIANS(DH51))*Visualization!$L$20+0)","v":""},{"$f":"IF($DA$8=\"\",\"\",COS(RADIANS(DH51))*Visualization!$L$20)","v":""},{"$f":"IF(DA51=\"\",\"\",_xlfn.NUMBERVALUE(Visualization!$L$20))","v":""},{"$f":"IF(DA51=\"\",\"\",_xlfn.NUMBERVALUE(Visualization!$L$21))","v":""},"","","",{"$f":"IF(Visualization!$F$21=\"\",\"\",IF(DA51=\"\",\"\",_xlfn.NUMBERVALUE(Visualization!$F$21)))","v":""}]
[null,null,null,null,null,null,null,null,null,null,null,null,null,null,null,null,null,null,null,null,null,null,null,null,null,null,null,null,null,null,null,null,null,null,null,null,null,null,null,null,null,null,null,null,null,null,null,null,null,null,null,null,null,null,null,null,null,null,null,null,null,null,null,null,null,null,null,{"$f":"IF(Values!C31=\"\",\"\",SMALL(Values!$D$13:$D$62,Values!C31))","v":""},{"$f":"IF(Values!D31=\"\",\"\",NORMSINV((Values!C31-0.3)/(COUNT($BP$34:$BP$83))))","v":""},null,null,null,null,"","",null,null,null,null,"",{"$f":"IF(BP52=\"\",\"\",_xlfn.NORM.S.INV((Values!C31-0.5)/Calculation!$DW$8))","v":""},null,null,null,null,"",{"$f":"IF(Values!D31=\"\",\"\",NORMSINV((Values!C31-0.3)/(COUNT($CH$34:$CH$83))))","v":""},null,null,null,null,"",{"$f":"IF(BP52=\"\",\"\",LN(LN(1/(1-((Values!C31-0.5)/$EI$8)))))","v":""},null,null,null,null,null,null,null,null,null,null,{"$f":"IF(Values!C57=\"\",\"\",CZ51+1)","v":""},{"$f":"IF(AND(Values!D57=\"\",Values!E57=\"\"),\"\",IF(Values!$E$4=\"1 Parameter\",Values!D57,SQRT(Values!D57^2+Values!E57^2)))","v":""},"",null,"","","","","",{"$f":"IF($DA$8=\"\",\"\",SIN(RADIANS(DH52))*Visualization!$L$20+0)","v":""},{"$f":"IF($DA$8=\"\",\"\",COS(RADIANS(DH52))*Visualization!$L$20)","v":""},{"$f":"IF(DA52=\"\",\"\",_xlfn.NUMBERVALUE(Visualization!$L$20))","v":""},{"$f":"IF(DA52=\"\",\"\",_xlfn.NUMBERVALUE(Visualization!$L$21))","v":""},"","","",{"$f":"IF(Visualization!$F$21=\"\",\"\",IF(DA52=\"\",\"\",_xlfn.NUMBERVALUE(Visualization!$F$21)))","v":""},null,null,null,null,null,null,null,null,null,null,null,null,null,null,null,null,null,null,null,null,null,null,null,null,null,null,null,null,null,null,null,null,"Max",{"$f":"MAX(EX7:EX49)","v":0},null,null,{"$f":"_xlfn.AGGREGATE(4,6,FA8:FA49)","v":0},null,{"$f":"_xlfn.AGGREGATE(4,6,FC8:FC49)","v":0},null,{"$f":"_xlfn.AGGREGATE(4,6,FE8:FE49)","v":0},null,{"$f":"_xlfn.AGGREGATE(4,6,FG8:FG49)","v":0},null,{"$f":"_xlfn.AGGREGATE(4,6,FI8:FI49)","v":0}]
[null,null,null,null,null,null,null,null,"Nr.","Value","Zi","ln[Zi]","Zn-i+1","1-Zn-i+1","ln[1-Zn-i+1]","lnZ +ln(1-Z)","(1-2i)/n",null,null,"Test value (AD)",null,null,null,null,null,null,null,null,null,null,"Nr.","Value","Zi","ln[Zi]","Zn-i+1","1-Zn-i+1","ln[1-Zn-i+1]","lnZ +ln(1-Z)","(1-2i)/n",null,{"$f":"_xlfn.CHISQ.TEST(INDEX($ER$117:$ER$158,COUNTIF(Calculation!$ER$117:$ER$158,0)+1,1):INDEX($ER$117:$ER$158,COUNT(Calculation!$ER$117:$ER$158)-COUNTIF(Calculation!$ER$117:$ER$158,0)+1,1),INDEX($FE$117:$FE$158,COUNTIF(Calculation!$ER$117:$ER$158,0)+1,1):INDEX($FE$117:$FE$158,COUNT(Calculation!$ER$117:$ER$158)-COUNTIF(Calculation!$ER$117:$ER$158,0)+1,1))","v":{"$error":"#VALUE!"}},null,"<",{"$f":"_xlfn.CHISQ.INV.RT(0.95,COUNT(EQ117:EQ158)-COUNTIF(EQ117:EQ158,0))","v":{"$error":"#NUM!"}},null,"The Chi-Square test focus on the peripheral areas of the distribution.",null,null,null,null,{"$f":"_xlfn.CHISQ.TEST(INDEX($ER$117:$ER$158,COUNTIF(Calculation!$ER$117:$ER$158,0)+1,1):INDEX($ER$117:$ER$158,COUNT(Calculation!$ER$117:$ER$158)-COUNTIF(Calculation!$ER$117:$ER$158,0)+1,1),INDEX($FA$117:$FA$158,COUNTIF(Calculation!$ER$117:$ER$158,0)+1,1):INDEX($FA$117:$FA$158,COUNT(Calculation!$ER$117:$ER$158)-COUNTIF(Calculation!$ER$117:$ER$158,0)+1,1))","v":{"$error":"#VALUE!"}},null,"<",{"$f":"_xlfn.CHISQ.INV.RT(0.95,COUNT(EQ117:EQ158)-COUNTIF(EQ117:EQ158,0))","v":{"$error":"#NUM!"}},null,"The Chi-Square test focus on the peripheral areas of the distribution.",null,null,null,null,null,null,null,null,null,null,null,{"$f":"IF(Values!C32=\"\",\"\",SMALL(Values!$D$13:$D$62,Values!C32))","v":""},{"$f":"IF(Values!D32=\"\",\"\",NORMSINV((Values!C32-0.3)/(COUNT($BP$34:$BP$83))))","v":""},null,null,null,null,"","",null,null,null,null,"",{"$f":"IF(BP53=\"\",\"\",_xlfn.NORM.S.INV((Values!C32-0.5)/Calculation!$DW$8))","v":""},null,null,null,null,"",{"$f":"IF(Values!D32=\"\",\"\",NORMSINV((Values!C32-0.3)/(COUNT($CH$34:$CH$83))))","v":""},null,null,null,null,"",{"$f":"IF(BP53=\"\",\"\",LN(LN(1/(1-((Values!C32-0.5)/$EI$8)))))","v":""},null,null,null,null,null,null,null,null,null,null,{"$f":"IF(Values!C58=\"\",\"\",CZ52+1)","v":""},{"$f":"IF(AND(Values!D58=\"\",Values!E58=\"\"),\"\",IF(Values!$E$4=\"1 Parameter\",Values!D58,SQRT(Values!D58^2+Values!E58^2)))","v":""},"",null,"","","","","",{"$f":"IF($DA$8=\"\",\"\",SIN(RADIANS(DH53))*Visualization!$L$20+0)","v":""},{"$f":"IF($DA$8=\"\",\"\",COS(RADIANS(DH53))*Visualization!$L$20)","v":""},{"$f":"IF(DA53=\"\",\"\",_xlfn.NUMBERVALUE(Visualization!$L$20))","v":""},{"$f":"IF(DA53=\"\",\"\",_xlfn.NUMBERVALUE(Visualization!$L$21))","v":""},"","","",{"$f":"IF(Visualization!$F$21=\"\",\"\",IF(DA53=\"\",\"\",_xlfn.NUMBERVALUE(Visualization!$F$21)))","v":""}]
[null,null,null,null,null,null,null,null,null,null,null,null,null,null,null,null,null,null,null,null,null,null,null,null,null,null,null,null,null,null,null,null,null,null,null,null,null,null,null,null,null,null,null,null,null,null,null,null,null,null,null,null,null,null,null,null,null,null,null,null,null,null,null,null,null,null,null,{"$f":"IF(Values!C33=\"\",\"\",SMALL(Values!$D$13:$D$62,Values!C33))","v":""},{"$f":"IF(Values!D33=\"\",\"\",NORMSINV((Values!C33-0.3)/(COUNT($BP$34:$BP$83))))","v":""},null,null,null,null,"","",null,null,null,null,"",{"$f":"IF(BP54=\"\",\"\",_xlfn.NORM.S.INV((Values!C33-0.5)/Calculation!$DW$8))","v":""},null,null,null,null,"",{"$f":"IF(Values!D33=\"\",\"\",NORMSINV((Values!C33-0.3)/(COUNT($CH$34:$CH$83))))","v":""},null,null,null,null,"",{"$f":"IF(BP54=\"\",\"\",LN(LN(1/(1-((Values!C33-0.5)/$EI$8)))))","v":""},null,null,null,null,null,null,null,null,null,null,{"$f":"IF(Values!C59=\"\",\"\",CZ53+1)","v":""},{"$f":"IF(AND(Values!D59=\"\",Values!E59=\"\"),\"\",IF(Values!$E$4=\"1 Parameter\",Values!D59,SQRT(Values!D59^2+Values!E59^2)))","v":""},"",null,"","","","","",{"$f":"IF($DA$8=\"\",\"\",SIN(RADIANS(DH54))*Visualization!$L$20+0)","v":""},{"$f":"IF($DA$8=\"\",\"\",COS(RADIANS(DH54))*Visualization!$L$20)","v":""},{"$f":"IF(DA54=\"\",\"\",_xlfn.NUMBERVALUE(Visualization!$L$20))","v":""},{"$f":"IF(DA54=\"\",\"\",_xlfn.NUMBERVALUE(Visualization!$L$21))","v":""},"","","",{"$f":"IF(Visualization!$F$21=\"\",\"\",IF(DA54=\"\",\"\",_xlfn.NUMBERVALUE(Visualization!$F$21)))","v":""}]
[null,null,null,null,null,null,null,null,{"$f":"IF(Values!$D$13=\"\",\"\",1)","v":""},{"$f":"IF(I55=\"\",\"\",SMALL($DA$8:$DA$57,I55))","v":""},{"$f":"IF(J55=\"\",\"\",NORMDIST(J55,Visualization!$F$51,Visualization!$F$53,TRUE))","v":""},{"$f":"IF(J55=\"\",\"\",IF(I55>COUNT(Values!$D$13:$D$62),0,LN(K55)))","v":""},{"$f":"IF(J55=\"\",\"\",LARGE(K$55:K$104,I55))","v":""},{"$f":"IF(J55=\"\",\"\",IF(M55=0,0,1-M55))","v":""},{"$f":"IF(J55=\"\",\"\",IF(N55=0,0,LN(N55)))","v":""},{"$f":"IF(J55=\"\",\"\",L55+O55)","v":""},{"$f":"IF(I55=\"\",\"\",(1-2*I55)/COUNT($I$55:$I$104))","v":""},null,null,{"$f":"_xlfn.CHISQ.TEST(INDEX($ER$117:$ER$158,COUNTIF(Calculation!$ER$117:$ER$158,0)+1,1):INDEX($ER$117:$ER$158,COUNT(Calculation!$ER$117:$ER$158)-COUNTIF(Calculation!$ER$117:$ER$158,0)+1,1),INDEX($FI$117:$FI$158,COUNTIF(Calculation!$ER$117:$ER$158,0)+1,1):INDEX($FI$117:$FI$158,COUNT(Calculation!$ER$117:$ER$158)-COUNTIF(Calculation!$ER$117:$ER$158,0)+1,1))","v":{"$error":"#VALUE!"}},null,"<",{"$f":"_xlfn.CHISQ.INV.RT(0.95,COUNT(EQ117:EQ158)-COUNTIF(EQ117:EQ158,0))","v":{"$error":"#NUM!"}},null,"The Chi-Square test focus on the peripheral areas of the distribution.",null,null,null,null,null,{"$f":"IF(Values!$D$13=\"\",\"\",1)","v":""},{"$f":"IF(AE55=\"\",\"\",SMALL($DB$8:$DB$57,AE55))","v":""},{"$f":"IF(AF55=\"\",\"\",NORMDIST(AF55,$CI$6,$EF$14,TRUE))","v":""},{"$f":"IF(AF55=\"\",\"\",IF(AE55>COUNT(Values!$D$13:$D$62),0,LN(AG55)))","v":""},{"$f":"IF(AF55=\"\",\"\",LARGE(AG$55:AG$104,AE55))","v":""},{"$f":"IF(AF55=\"\",\"\",IF(AI55=0,0,1-AI55))","v":""},{"$f":"IF(AF55=\"\",\"\",IF(AJ55=0,0,LN(AJ55)))","v":""},{"$f":"IF(AF55=\"\",\"\",AH55+AK55)","v":""},{"$f":"IF(AE55=\"\",\"\",(1-2*AE55)/COUNT($AE$55:$AE$104))","v":""},null,null,null,null,null,null,null,null,null,null,null,null,null,null,null,null,null,null,null,null,null,null,null,null,null,null,null,null,{"$f":"IF(Values!C34=\"\",\"\",SMALL(Values!$D$13:$D$62,Values!C34))","v":""},{"$f":"IF(Values!D34=\"\",\"\",NORMSINV((Values!C34-0.3)/(COUNT($BP$34:$BP$83))))","v":""},null,null,null,null,"","",null,null,null,null,"",{"$f":"IF(BP55=\"\",\"\",_xlfn.NORM.S.INV((Values!C34-0.5)/Calculation!$DW$8))","v":""},null,null,null,null,"",{"$f":"IF(Values!D34=\"\",\"\",NORMSINV((Values!C34-0.3)/(COUNT($CH$34:$CH$83))))","v":""},null,null,null,null,"",{"$f":"IF(BP55=\"\",\"\",LN(LN(1/(1-((Values!C34-0.5)/$EI$8)))))","v":""},null,null,null,null,null,null,null,null,null,null,{"$f":"IF(Values!C60=\"\",\"\",CZ54+1)","v":""},{"$f":"IF(AND(Values!D60=\"\",Values!E60=\"\"),\"\",IF(Values!$E$4=\"1 Parameter\",Values!D60,SQRT(Values!D60^2+Values!E60^2)))","v":""},"",null,"","","","","",{"$f":"IF($DA$8=\"\",\"\",SIN(RADIANS(DH55))*Visualization!$L$20+0)","v":""},{"$f":"IF($DA$8=\"\",\"\",COS(RADIANS(DH55))*Visualization!$L$20)","v":""},{"$f":"IF(DA55=\"\",\"\",_xlfn.NUMBERVALUE(Visualization!$L$20))","v":""},{"$f":"IF(DA55=\"\",\"\",_xlfn.NUMBERVALUE(Visualization!$L$21))","v":""},"","","",{"$f":"IF(Visualization!$F$21=\"\",\"\",IF(DA55=\"\",\"\",_xlfn.NUMBERVALUE(Visualization!$F$21)))","v":""}]
[null,null,null,null,null,null,null,null,{"$f":"IF(Values!$D$14=\"\",\"\",2)","v":""},"",{"$f":"IF(J56=\"\",\"\",NORMDIST(J56,Visualization!$F$51,Visualization!$F$53,TRUE))","v":""},{"$f":"IF(J56=\"\",\"\",IF(I56>COUNT(Values!$D$13:$D$62),0,LN(K56)))","v":""},"",{"$f":"IF(J56=\"\",\"\",IF(M56=0,0,1-M56))","v":""},{"$f":"IF(J56=\"\",\"\",IF(N56=0,0,LN(N56)))","v":""},{"$f":"IF(J56=\"\",\"\",L56+O56)","v":""},"",null,null,null,null,null,null,null,null,null,null,null,null,null,{"$f":"IF(Values!$D$14=\"\",\"\",2)","v":""},"","",{"$f":"IF(AF56=\"\",\"\",IF(AE56>COUNT(Values!$D$13:$D$62),0,LN(AG56)))","v":""},{"$f":"IF(AF56=\"\",\"\",LARGE(AG$55:AG$104,AE56))","v":""},{"$f":"IF(AF56=\"\",\"\",IF(AI56=0,0,1-AI56))","v":""},{"$f":"IF(AF56=\"\",\"\",IF(AJ56=0,0,LN(AJ56)))","v":""},{"$f":"IF(AF56=\"\",\"\",AH56+AK56)","v":""},{"$f":"IF(AE56=\"\",\"\",(1-2*AE56)/COUNT($AE$55:$AE$104))","v":""},null,null,null,null,null,null,null,null,null,null,null,null,null,null,null,null,null,null,null,null,null,null,null,null,null,null,null,null,{"$f":"IF(Values!C35=\"\",\"\",SMALL(Values!$D$13:$D$62,Values!C35))","v":""},{"$f":"IF(Values!D35=\"\",\"\",NORMSINV((Values!C35-0.3)/(COUNT($BP$34:$BP$83))))","v":""},null,null,null,null,"","",null,null,null,null,"",{"$f":"IF(BP56=\"\",\"\",_xlfn.NORM.S.INV((Values!C35-0.5)/Calculation!$DW$8))","v":""},null,null,null,null,"",{"$f":"IF(Values!D35=\"\",\"\",NORMSINV((Values!C35-0.3)/(COUNT($CH$34:$CH$83))))","v":""},null,null,null,null,"",{"$f":"IF(BP56=\"\",\"\",LN(LN(1/(1-((Values!C35-0.5)/$EI$8)))))","v":""},null,null,null,null,null,null,null,null,null,null,{"$f":"IF(Values!C61=\"\",\"\",CZ55+1)","v":""},{"$f":"IF(AND(Values!D61=\"\",Values!E61=\"\"),\"\",IF(Values!$E$4=\"1 Parameter\",Values!D61,SQRT(Values!D61^2+Values!E61^2)))","v":""},"",null,"","","","","",{"$f":"IF($DA$8=\"\",\"\",SIN(RADIANS(DH56))*Visualization!$L$20+0)","v":""},{"$f":"IF($DA$8=\"\",\"\",COS(RADIANS(DH56))*Visualization!$L$20)","v":""},{"$f":"IF(DA56=\"\",\"\",_xlfn.NUMBERVALUE(Visualization!$L$20))","v":""},{"$f":"IF(DA56=\"\",\"\",_xlfn.NUMBERVALUE(Visualization!$L$21))","v":""},"","","",{"$f":"IF(Visualization!$F$21=\"\",\"\",IF(DA56=\"\",\"\",_xlfn.NUMBERVALUE(Visualization!$F$21)))","v":""}]
[null,null,null,null,null,null,null,null,{"$f":"IF(Values!$D$15=\"\",\"\",3)","v":""},"",{"$f":"IF(J57=\"\",\"\",NORMDIST(J57,Visualization!$F$51,Visualization!$F$53,TRUE))","v":""},{"$f":"IF(J57=\"\",\"\",IF(I57>COUNT(Values!$D$13:$D$62),0,LN(K57)))","v":""},"","","","","",null,null,null,null,null,null,null,null,null,null,null,null,null,{"$f":"IF(Values!$D$15=\"\",\"\",3)","v":""},"","",{"$f":"IF(AF57=\"\",\"\",IF(AE57>COUNT(Values!$D$13:$D$62),0,LN(AG57)))","v":""},"","","","","",null,"H1 = True If AD > SW",null,null,"H1: Values are normal ditributed",null,null,null,null,null,null,"H1 = True If AD > SW",null,null,"H1: Values are normal ditributed",null,null,null,null,null,null,null,null,null,null,null,null,null,{"$f":"IF(Values!C36=\"\",\"\",SMALL(Values!$D$13:$D$62,Values!C36))","v":""},{"$f":"IF(Values!D36=\"\",\"\",NORMSINV((Values!C36-0.3)/(COUNT($BP$34:$BP$83))))","v":""},null,null,null,null,"","",null,null,null,null,"",{"$f":"IF(BP57=\"\",\"\",_xlfn.NORM.S.INV((Values!C36-0.5)/Calculation!$DW$8))","v":""},null,null,null,null,"",{"$f":"IF(Values!D36=\"\",\"\",NORMSINV((Values!C36-0.3)/(COUNT($CH$34:$CH$83))))","v":""},null,null,null,null,"",{"$f":"IF(BP57=\"\",\"\",LN(LN(1/(1-((Values!C36-0.5)/$EI$8)))))","v":""},null,null,null,null,null,null,null,null,null,null,{"$f":"IF(Values!C62=\"\",\"\",CZ56+1)","v":""},{"$f":"IF(AND(Values!D62=\"\",Values!E62=\"\"),\"\",IF(Values!$E$4=\"1 Parameter\",Values!D62,SQRT(Values!D62^2+Values!E62^2)))","v":""},"",null,"","","","","",{"$f":"IF($DA$8=\"\",\"\",SIN(RADIANS(DH57))*Visualization!$L$20+0)","v":""},{"$f":"IF($DA$8=\"\",\"\",COS(RADIANS(DH57))*Visualization!$L$20)","v":""},{"$f":"IF(DA57=\"\",\"\",_xlfn.NUMBERVALUE(Visualization!$L$20))","v":""},{"$f":"IF(DA57=\"\",\"\",_xlfn.NUMBERVALUE(Visualization!$L$21))","v":""},"","","",{"$f":"IF(Visualization!$F$21=\"\",\"\",IF(DA57=\"\",\"\",_xlfn.NUMBERVALUE(Visualization!$F$21)))","v":""}]
[null,null,null,null,null,null,null,null,{"$f":"IF(Values!$D$16=\"\",\"\",4)","v":""},"",{"$f":"IF(J58=\"\",\"\",NORMDIST(J58,Visualization!$F$51,Visualization!$F$53,TRUE))","v":""},{"$f":"IF(J58=\"\",\"\",IF(I58>COUNT(Values!$D$13:$D$62),0,LN(K58)))","v":""},"","","","","",null,null,null,null,null,null,null,null,null,null,null,null,null,{"$f":"IF(Values!$D$16=\"\",\"\",4)","v":""},"","",{"$f":"IF(AF58=\"\",\"\",IF(AE58>COUNT(Values!$D$13:$D$62),0,LN(AG58)))","v":""},"","","","","",null,"H0 = True If AD < SW",null,null,"H0: Values are not normal distributed",null,null,null,null,null,null,"H0 = True If AD < SW",null,null,"H0: Values are not normal distributed",null,null,null,null,null,null,null,null,null,null,null,null,null,{"$f":"IF(Values!C37=\"\",\"\",SMALL(Values!$D$13:$D$62,Values!C37))","v":""},{"$f":"IF(Values!D37=\"\",\"\",NORMSINV((Values!C37-0.3)/(COUNT($BP$34:$BP$83))))","v":""},null,null,null,null,"","",null,null,null,null,"",{"$f":"IF(BP58=\"\",\"\",_xlfn.NORM.S.INV((Values!C37-0.5)/Calculation!$DW$8))","v":""},null,null,null,null,"",{"$f":"IF(Values!D37=\"\",\"\",NORMSINV((Values!C37-0.3)/(COUNT($CH$34:$CH$83))))","v":""},null,null,null,null,"",{"$f":"IF(BP58=\"\",\"\",LN(LN(1/(1-((Values!C37-0.5)/$EI$8)))))","v":""},null,null,null,null,null,null,null,null,null,null,null,null,null,null,null,"",null,null,"",{"$f":"IF($DA$8=\"\",\"\",SIN(RADIANS(DH58))*Visualization!$L$20+0)","v":""},{"$f":"IF($DA$8=\"\",\"\",COS(RADIANS(DH58))*Visualization!$L$20)","v":""}]
[null,null,null,null,null,null,null,null,{"$f":"IF(Values!$D$17=\"\",\"\",5)","v":""},"",{"$f":"IF(J59=\"\",\"\",NORMDIST(J59,Visualization!$F$51,Visualization!$F$53,TRUE))","v":""},{"$f":"IF(J59=\"\",\"\",IF(I59>COUNT(Values!$D$13:$D$62),0,LN(K59)))","v":""},"","","","","",null,null,"H1 = True If AD > SW",null,null,"H1: Values are normal ditributed",null,null,null,null,null,null,null,{"$f":"IF(Values!$D$17=\"\",\"\",5)","v":""},"","",{"$f":"IF(AF59=\"\",\"\",IF(AE59>COUNT(Values!$D$13:$D$62),0,LN(AG59)))","v":""},"","","","","",null,null,null,null,null,null,null,null,null,null,null,null,null,null,null,null,null,null,null,null,null,null,null,null,null,null,null,null,{"$f":"IF(Values!C38=\"\",\"\",SMALL(Values!$D$13:$D$62,Values!C38))","v":""},{"$f":"IF(Values!D38=\"\",\"\",NORMSINV((Values!C38-0.3)/(COUNT($BP$34:$BP$83))))","v":""},null,null,null,null,"","",null,null,null,null,"",{"$f":"IF(BP59=\"\",\"\",_xlfn.NORM.S.INV((Values!C38-0.5)/Calculation!$DW$8))","v":""},null,null,null,null,"",{"$f":"IF(Values!D38=\"\",\"\",NORMSINV((Values!C38-0.3)/(COUNT($CH$34:$CH$83))))","v":""},null,null,null,null,"",{"$f":"IF(BP59=\"\",\"\",LN(LN(1/(1-((Values!C38-0.5)/$EI$8)))))","v":""}]
[null,null,null,null,null,null,null,null,{"$f":"IF(Values!$D$18=\"\",\"\",6)","v":""},"",{"$f":"IF(J60=\"\",\"\",NORMDIST(J60,Visualization!$F$51,Visualization!$F$53,TRUE))","v":""},{"$f":"IF(J60=\"\",\"\",IF(I60>COUNT(Values!$D$13:$D$62),0,LN(K60)))","v":""},"","","","","",null,null,"H0 = True If AD < SW",null,null,"H0: Values are not normal distributed",null,null,null,null,null,null,null,{"$f":"IF(Values!$D$18=\"\",\"\",6)","v":""},"","",{"$f":"IF(AF60=\"\",\"\",IF(AE60>COUNT(Values!$D$13:$D$62),0,LN(AG60)))","v":""},"","","","","",null,null,null,null,null,null,null,null,null,null,null,null,null,null,null,null,null,null,null,null,null,null,null,null,null,null,null,null,{"$f":"IF(Values!C39=\"\",\"\",SMALL(Values!$D$13:$D$62,Values!C39))","v":""},{"$f":"IF(Values!D39=\"\",\"\",NORMSINV((Values!C39-0.3)/(COUNT($BP$34:$BP$83))))","v":""},null,null,null,null,"","",null,null,null,null,"",{"$f":"IF(BP60=\"\",\"\",_xlfn.NORM.S.INV((Values!C39-0.5)/Calculation!$DW$8))","v":""},null,null,null,null,"",{"$f":"IF(Values!D39=\"\",\"\",NORMSINV((Values!C39-0.3)/(COUNT($CH$34:$CH$83))))","v":""},null,null,null,null,"",{"$f":"IF(BP60=\"\",\"\",LN(LN(1/(1-((Values!C39-0.5)/$EI$8)))))","v":""}]
[null,null,null,null,null,null,null,null,{"$f":"IF(Values!$D$19=\"\",\"\",7)","v":""},"",{"$f":"IF(J61=\"\",\"\",NORMDIST(J61,Visualization!$F$51,Visualization!$F$53,TRUE))","v":""},{"$f":"IF(J61=\"\",\"\",IF(I61>COUNT(Values!$D$13:$D$62),0,LN(K61)))","v":""},"","","","","",null,null,null,null,null,null,null,null,null,null,null,null,null,{"$f":"IF(Values!$D$19=\"\",\"\",7)","v":""},"","",{"$f":"IF(AF61=\"\",\"\",IF(AE61>COUNT(Values!$D$13:$D$62),0,LN(AG61)))","v":""},"","","","","",null,null,null,null,null,null,null,null,null,null,null,null,null,null,null,null,null,null,null,null,null,null,null,null,null,null,null,null,{"$f":"IF(Values!C40=\"\",\"\",SMALL(Values!$D$13:$D$62,Values!C40))","v":""},{"$f":"IF(Values!D40=\"\",\"\",NORMSINV((Values!C40-0.3)/(COUNT($BP$34:$BP$83))))","v":""},null,null,null,null,"","",null,null,null,null,"",{"$f":"IF(BP61=\"\",\"\",_xlfn.NORM.S.INV((Values!C40-0.5)/Calculation!$DW$8))","v":""},null,null,null,null,"",{"$f":"IF(Values!D40=\"\",\"\",NORMSINV((Values!C40-0.3)/(COUNT($CH$34:$CH$83))))","v":""},null,null,null,null,"",{"$f":"IF(BP61=\"\",\"\",LN(LN(1/(1-((Values!C40-0.5)/$EI$8)))))","v":""},null,null,null,null,null,null,null,null,null,null,null,null,null,null,null,null,null,null,null,null,null,null,null,null,null,null,null,null,null,null,null,null,null,null,null,null,null,null,null,null,null,null,null,null,null,null,null,null,null,null,"Classes","Values per class",null,"Number of values per class [%]","Number of values per class [%] (accumulated)","USL","LSL","Amount of classes","Set Point",null,"Y- Values","Y- Values (accumulated)"]
[null,null,null,null,null,null,null,null,{"$f":"IF(Values!$D$20=\"\",\"\",8)","v":""},"",{"$f":"IF(J62=\"\",\"\",NORMDIST(J62,Visualization!$F$51,Visualization!$F$53,TRUE))","v":""},{"$f":"IF(J62=\"\",\"\",IF(I62>COUNT(Values!$D$13:$D$62),0,LN(K62)))","v":""},"","","","","",null,null,null,null,null,null,null,null,null,null,null,null,null,{"$f":"IF(Values!$D$20=\"\",\"\",8)","v":""},"","",{"$f":"IF(AF62=\"\",\"\",IF(AE62>COUNT(Values!$D$13:$D$62),0,LN(AG62)))","v":""},"","","","","",null,null,null,null,null,null,null,null,null,null,null,"Rang i","Sortiert","Fi","ln[Fi]","Sortiert","1-Fn-i+1","ln[1-Fn-i+1]","lnF +ln(1-F)","(1-2i)/n",null,null,null,null,null,null,null,null,{"$f":"IF(Values!C41=\"\",\"\",SMALL(Values!$D$13:$D$62,Values!C41))","v":""},{"$f":"IF(Values!D41=\"\",\"\",NORMSINV((Values!C41-0.3)/(COUNT($BP$34:$BP$83))))","v":""},null,null,null,null,"","",null,null,null,null,"",{"$f":"IF(BP62=\"\",\"\",_xlfn.NORM.S.INV((Values!C41-0.5)/Calculation!$DW$8))","v":""},null,null,null,null,"",{"$f":"IF(Values!D41=\"\",\"\",NORMSINV((Values!C41-0.3)/(COUNT($CH$34:$CH$83))))","v":""},null,null,null,null,"",{"$f":"IF(BP62=\"\",\"\",LN(LN(1/(1-((Values!C41-0.5)/$EI$8)))))","v":""},null,null,null,null,null,null,null,null,null,null,null,null,null,null,null,null,null,null,null,null,null,null,null,null,null,null,null,null,null,null,null,null,null,null,null,null,null,null,null,null,null,null,null,null,null,null,null,null,null,null,null,null,null,null,null,null,null,null,null,null,{"$f":"IF($EN63=\"\",\"\",NORMDIST($EN63-$EF$13,$CI$6,$EF$14,0))","v":""},{"$f":"IF(EN8=\"\",\"\",NORMDIST(EN8-DW13,Visualization!$F$51,Visualization!$F$53,1)*100)","v":""}]
[null,null,null,null,null,null,null,null,{"$f":"IF(Values!$D$21=\"\",\"\",9)","v":""},"",{"$f":"IF(J63=\"\",\"\",NORMDIST(J63,Visualization!$F$51,Visualization!$F$53,TRUE))","v":""},{"$f":"IF(J63=\"\",\"\",IF(I63>COUNT(Values!$D$13:$D$62),0,LN(K63)))","v":""},"","","","","",null,null,null,null,null,null,null,null,null,null,null,null,null,{"$f":"IF(Values!$D$21=\"\",\"\",9)","v":""},"","",{"$f":"IF(AF63=\"\",\"\",IF(AE63>COUNT(Values!$D$13:$D$62),0,LN(AG63)))","v":""},"","","","","",null,null,null,null,null,null,null,null,null,null,null,null,null,null,null,null,null,null,null,null,null,null,null,null,null,null,null,null,{"$f":"IF(Values!C42=\"\",\"\",SMALL(Values!$D$13:$D$62,Values!C42))","v":""},{"$f":"IF(Values!D42=\"\",\"\",NORMSINV((Values!C42-0.3)/(COUNT($BP$34:$BP$83))))","v":""},null,null,null,null,"","",null,null,null,null,"",{"$f":"IF(BP63=\"\",\"\",_xlfn.NORM.S.INV((Values!C42-0.5)/Calculation!$DW$8))","v":""},null,null,null,null,"",{"$f":"IF(Values!D42=\"\",\"\",NORMSINV((Values!C42-0.3)/(COUNT($CH$34:$CH$83))))","v":""},null,null,null,null,"",{"$f":"IF(BP63=\"\",\"\",LN(LN(1/(1-((Values!C42-0.5)/$EI$8)))))","v":""},null,null,null,null,null,null,null,null,null,null,null,null,null,null,null,null,null,null,null,null,null,null,null,null,null,null,null,null,null,null,null,null,null,null,null,null,null,null,null,null,null,null,null,null,null,null,null,null,null,null,{"$f":"IFERROR(LN(EN8),\"\")","v":""},{"$f":"IF(EN63=\"\",\"\",FREQUENCY($DB$8:$DB$57,EN63))","v":""},{"$f":"EO63","v":""},{"$f":"IF(EP63=\"\",\"\",(100/(SUM($EP$8:$EP$27))*EP63))","v":""},{"$f":"IF(EP63=\"\",\"\",EQ63)","v":""},{"$f":"IF(ER63=\"\",\"\",LN(_xlfn.NUMBERVALUE(Visualization!$L$20)))","v":""},{"$f":"IF(ER63=\"\",\"\",LN(_xlfn.NUMBERVALUE(Visualization!$L$21)))","v":""},{"$f":"IF(EO63=\"\",\"\",MAX($EQ$8:$EQ$27))","v":""},{"$f":"IF(EU63=\"\",\"\",IF(Visualization!$F$21=\"\",0,LN(_xlfn.NUMBERVALUE(Visualization!$F$21))))","v":""},null,{"$f":"IF($EN64=\"\",\"\",NORMDIST($EN64-$EF$13,$CI$6,$EF$14,0))","v":""},{"$f":"IF(EN9=\"\",\"\",IF(EY7>99.98,\"\",NORMDIST(EN8,Visualization!$F$51,Visualization!$F$53,1)*100))","v":""}]
[null,null,null,null,null,null,null,null,{"$f":"IF(Values!$D$22=\"\",\"\",10)","v":""},"",{"$f":"IF(J64=\"\",\"\",NORMDIST(J64,Visualization!$F$51,Visualization!$F$53,TRUE))","v":""},{"$f":"IF(J64=\"\",\"\",IF(I64>COUNT(Values!$D$13:$D$62),0,LN(K64)))","v":""},"","","","","",null,null,null,null,null,null,null,null,null,null,null,null,null,{"$f":"IF(Values!$D$22=\"\",\"\",10)","v":""},"","",{"$f":"IF(AF64=\"\",\"\",IF(AE64>COUNT(Values!$D$13:$D$62),0,LN(AG64)))","v":""},"","","","","",null,null,null,null,null,null,null,null,null,null,null,{"$f":"AE55","v":""},{"$f":"IF(AY64=\"\",\"\",SMALL($DA$8:$DA$57,AY64))","v":""},{"$f":"IF(AY64<>\"\",1-EXP(-1*((AZ64)/($CR$45))^$CR$44),\"\")","v":""},{"$f":"IF(AY64=\"\",\"\",LN(BA64))","v":""},{"$f":"IF(AY64=\"\",\"\",LARGE($DA$8:$DA$57,AY64))","v":""},{"$f":"IF(AY64<>\"\",1-(1-EXP(-1*((BC64)/($CR$45))^$CR$44)),\"\")","v":""},{"$f":"IF(AY64=\"\",\"\",LN(BD64))","v":""},{"$f":"IF(BB64=\"\",\"\",BB64+BE64)","v":""},{"$f":"IF(AY64=\"\",\"\",(1-2*AY64)/$DW$8)","v":""},null,null,null,null,null,null,null,null,{"$f":"IF(Values!C43=\"\",\"\",SMALL(Values!$D$13:$D$62,Values!C43))","v":""},{"$f":"IF(Values!D43=\"\",\"\",NORMSINV((Values!C43-0.3)/(COUNT($BP$34:$BP$83))))","v":""},null,null,null,null,"","",null,null,null,null,"",{"$f":"IF(BP64=\"\",\"\",_xlfn.NORM.S.INV((Values!C43-0.5)/Calculation!$DW$8))","v":""},null,null,null,null,"",{"$f":"IF(Values!D43=\"\",\"\",NORMSINV((Values!C43-0.3)/(COUNT($CH$34:$CH$83))))","v":""},null,null,null,null,"",{"$f":"IF(BP64=\"\",\"\",LN(LN(1/(1-((Values!C43-0.5)/$EI$8)))))","v":""},null,null,null,null,null,null,null,null,null,null,null,null,null,null,null,null,null,null,null,null,null,null,null,null,null,null,null,null,null,null,null,null,null,null,null,null,null,null,null,null,null,null,null,null,null,null,null,null,null,null,{"$f":"IFERROR(LN(EN9),\"\")","v":""},{"$f":"IF(EN64=\"\",\"\",FREQUENCY($DB$8:$DB$57,EN64))","v":""},{"$f":"IF(EO64=\"\",\"\",EO64-EO63)","v":""},"",{"$f":"IF(EP64=\"\",\"\",ER63+EQ64)","v":""},{"$f":"IF(ER64=\"\",\"\",LN(_xlfn.NUMBERVALUE(Visualization!$L$20)))","v":""},{"$f":"IF(ER64=\"\",\"\",LN(_xlfn.NUMBERVALUE(Visualization!$L$21)))","v":""},"",{"$f":"IF(EU64=\"\",\"\",IF(Visualization!$F$21=\"\",0,LN(_xlfn.NUMBERVALUE(Visualization!$F$21))))","v":""},null,"",{"$f":"IF(EN10=\"\",\"\",IF(EY8>99.98,\"\",NORMDIST(EN9,Visualization!$F$51,Visualization!$F$53,1)*100))","v":""}]
[null,null,null,null,null,null,null,null,{"$f":"IF(Values!$D$23=\"\",\"\",11)","v":""},"",{"$f":"IF(J65=\"\",\"\",NORMDIST(J65,Visualization!$F$51,Visualization!$F$53,TRUE))","v":""},{"$f":"IF(J65=\"\",\"\",IF(I65>COUNT(Values!$D$13:$D$62),0,LN(K65)))","v":""},"","","","","",null,null,"Rang i","Sortiert","Fi","ln[Fi]","Sortiert","1-Fn-i+1","ln[1-Fn-i+1]","lnF +ln(1-F)","(1-2i)/n",null,null,{"$f":"IF(Values!$D$23=\"\",\"\",11)","v":""},"","",{"$f":"IF(AF65=\"\",\"\",IF(AE65>COUNT(Values!$D$13:$D$62),0,LN(AG65)))","v":""},"","","","","",null,null,null,null,null,null,null,null,null,null,null,{"$f":"AE56","v":""},"","",{"$f":"IF(AY65=\"\",\"\",LN(BA65))","v":""},"","",{"$f":"IF(AY65=\"\",\"\",LN(BD65))","v":""},{"$f":"IF(BB65=\"\",\"\",BB65+BE65)","v":""},"",null,null,null,null,null,null,null,null,{"$f":"IF(Values!C44=\"\",\"\",SMALL(Values!$D$13:$D$62,Values!C44))","v":""},{"$f":"IF(Values!D44=\"\",\"\",NORMSINV((Values!C44-0.3)/(COUNT($BP$34:$BP$83))))","v":""},null,null,null,null,"","",null,null,null,null,"",{"$f":"IF(BP65=\"\",\"\",_xlfn.NORM.S.INV((Values!C44-0.5)/Calculation!$DW$8))","v":""},null,null,null,null,"",{"$f":"IF(Values!D44=\"\",\"\",NORMSINV((Values!C44-0.3)/(COUNT($CH$34:$CH$83))))","v":""},null,null,null,null,"",{"$f":"IF(BP65=\"\",\"\",LN(LN(1/(1-((Values!C44-0.5)/$EI$8)))))","v":""},null,null,null,null,null,null,null,null,null,null,null,null,null,null,null,null,null,null,null,null,null,null,null,null,null,null,null,null,null,null,null,null,null,null,null,null,null,null,null,null,null,null,null,null,null,null,null,null,null,null,"","",{"$f":"IF(EO64=\"\",EO65,IF(EO65=\"\",\"\",EO65-EO64))","v":""},{"$f":"IF(EP65=\"\",\"\",(100/(SUM($EP$8:$EP$27))*EP65))","v":""},{"$f":"IF(ER64=\"\",EP65,IF(EP65=\"\",\"\",ER64+EQ65))","v":""},{"$f":"IF(ER65=\"\",\"\",LN(_xlfn.NUMBERVALUE(Visualization!$L$20)))","v":""},{"$f":"IF(ER65=\"\",\"\",LN(_xlfn.NUMBERVALUE(Visualization!$L$21)))","v":""},"",{"$f":"IF(EU65=\"\",\"\",IF(Visualization!$F$21=\"\",0,LN(_xlfn.NUMBERVALUE(Visualization!$F$21))))","v":""},null,"",{"$f":"IF(EN11=\"\",\"\",IF(EY9>99.98,\"\",NORMDIST(EN10,Visualization!$F$51,Visualization!$F$53,1)*100))","v":""}]
[null,null,null,null,null,null,null,null,{"$f":"IF(Values!$D$24=\"\",\"\",12)","v":""},"",{"$f":"IF(J66=\"\",\"\",NORMDIST(J66,Visualization!$F$51,Visualization!$F$53,TRUE))","v":""},{"$f":"IF(J66=\"\",\"\",IF(I66>COUNT(Values!$D$13:$D$62),0,LN(K66)))","v":""},"","","","","",null,null,null,null,null,null,null,null,null,null,null,null,null,{"$f":"IF(Values!$D$24=\"\",\"\",12)","v":""},"","",{"$f":"IF(AF66=\"\",\"\",IF(AE66>COUNT(Values!$D$13:$D$62),0,LN(AG66)))","v":""},"","","","","",null,null,null,null,null,null,null,null,null,null,null,"","","","","","","","","",null,null,null,null,null,null,null,null,{"$f":"IF(Values!C45=\"\",\"\",SMALL(Values!$D$13:$D$62,Values!C45))","v":""},{"$f":"IF(Values!D45=\"\",\"\",NORMSINV((Values!C45-0.3)/(COUNT($BP$34:$BP$83))))","v":""},null,null,null,null,{"$f":"IF(BP66=\"\",\"\",CN66)","v":""},{"$f":"IF(BP66=\"\",\"\",CO66)","v":""},null,null,null,null,{"$f":"BP66","v":""},{"$f":"IF(BP66=\"\",\"\",_xlfn.NORM.S.INV((Values!C45-0.5)/Calculation!$DW$8))","v":""},null,null,null,null,{"$f":"IF(BP66=\"\",\"\",IF($CI$6=\"\",\"\",SMALL($DB$8:$DB$57,CZ40)))","v":""},{"$f":"IF(Values!D45=\"\",\"\",NORMSINV((Values!C45-0.3)/(COUNT($CH$34:$CH$83))))","v":""},null,null,null,null,"",{"$f":"IF(BP66=\"\",\"\",LN(LN(1/(1-((Values!C45-0.5)/$EI$8)))))","v":""},null,null,null,null,null,null,null,null,null,null,null,null,null,null,null,null,null,null,null,null,null,null,null,null,null,null,null,null,null,null,null,null,null,null,null,null,null,null,null,null,null,null,null,null,null,null,null,null,null,null,"","",{"$f":"IF(EO65=\"\",EO66,IF(EO66=\"\",\"\",EO66-EO65))","v":""},"",{"$f":"IF(ER65=\"\",EP66,IF(EP66=\"\",\"\",ER65+EQ66))","v":""},{"$f":"IF(ER66=\"\",\"\",LN(_xlfn.NUMBERVALUE(Visualization!$L$20)))","v":""},{"$f":"IF(ER66=\"\",\"\",LN(_xlfn.NUMBERVALUE(Visualization!$L$21)))","v":""},"",{"$f":"IF(EU66=\"\",\"\",IF(Visualization!$F$21=\"\",0,LN(_xlfn.NUMBERVALUE(Visualization!$F$21))))","v":""},null,"",{"$f":"IF(EN12=\"\",\"\",IF(EY10>99.98,\"\",NORMDIST(EN11,Visualization!$F$51,Visualization!$F$53,1)*100))","v":""}]
[null,null,null,null,null,null,null,null,{"$f":"IF(Values!$D$25=\"\",\"\",13)","v":""},"",{"$f":"IF(J67=\"\",\"\",NORMDIST(J67,Visualization!$F$51,Visualization!$F$53,TRUE))","v":""},{"$f":"IF(J67=\"\",\"\",IF(I67>COUNT(Values!$D$13:$D$62),0,LN(K67)))","v":""},"","","","","",null,null,{"$f":"I55","v":""},{"$f":"IF(T67=\"\",\"\",SMALL($DA$8:$DA$57,T67))","v":""},{"$f":"IF(T67<>\"\",1-EXP(-1*((U67)/($CR$45))^2),\"\")","v":""},{"$f":"IF(T67=\"\",\"\",LN(V67))","v":""},{"$f":"IF(T67=\"\",\"\",LARGE($DA$8:$DA$57,T67))","v":""},{"$f":"IF(T67<>\"\",1-(1-EXP(-1*((X67)/($CR$45))^2)),\"\")","v":""},{"$f":"IF(T67=\"\",\"\",LN(Y67))","v":""},{"$f":"IF(W67=\"\",\"\",W67+Z67)","v":""},{"$f":"IF(T67=\"\",\"\",(1-2*T67)/$DW$8)","v":""},null,null,{"$f":"IF(Values!$D$25=\"\",\"\",13)","v":""},"","",{"$f":"IF(AF67=\"\",\"\",IF(AE67>COUNT(Values!$D$13:$D$62),0,LN(AG67)))","v":""},"","","","","",null,null,null,null,null,null,null,null,null,null,null,"","","","","","","","","",null,null,null,null,null,null,null,null,{"$f":"IF(Values!C46=\"\",\"\",SMALL(Values!$D$13:$D$62,Values!C46))","v":""},{"$f":"IF(Values!D46=\"\",\"\",NORMSINV((Values!C46-0.3)/(COUNT($BP$34:$BP$83))))","v":""},null,null,null,null,"","",null,null,null,null,"",{"$f":"IF(BP67=\"\",\"\",_xlfn.NORM.S.INV((Values!C46-0.5)/Calculation!$DW$8))","v":""},null,null,null,null,"",{"$f":"IF(Values!D46=\"\",\"\",NORMSINV((Values!C46-0.3)/(COUNT($CH$34:$CH$83))))","v":""},null,null,null,null,"",{"$f":"IF(BP67=\"\",\"\",LN(LN(1/(1-((Values!C46-0.5)/$EI$8)))))","v":""},null,null,null,null,null,null,null,null,null,null,null,null,null,null,null,null,null,null,null,null,null,null,null,null,null,null,null,null,null,null,null,null,null,null,null,null,null,null,null,null,null,null,null,null,null,null,null,null,null,null,"","","","","",{"$f":"IF(ER67=\"\",\"\",LN(_xlfn.NUMBERVALUE(Visualization!$L$20)))","v":""},{"$f":"IF(ER67=\"\",\"\",LN(_xlfn.NUMBERVALUE(Visualization!$L$21)))","v":""},"",{"$f":"IF(EU67=\"\",\"\",IF(Visualization!$F$21=\"\",0,LN(_xlfn.NUMBERVALUE(Visualization!$F$21))))","v":""},null,"",{"$f":"IF(EN13=\"\",\"\",IF(EY11>99.98,\"\",NORMDIST(EN12,Visualization!$F$51,Visualization!$F$53,1)*100))","v":""}]
[null,null,null,null,null,null,null,null,{"$f":"IF(Values!$D$26=\"\",\"\",14)","v":""},"",{"$f":"IF(J68=\"\",\"\",NORMDIST(J68,Visualization!$F$51,Visualization!$F$53,TRUE))","v":""},{"$f":"IF(J68=\"\",\"\",IF(I68>COUNT(Values!$D$13:$D$62),0,LN(K68)))","v":""},"","","","","",null,null,{"$f":"I56","v":""},"","",{"$f":"IF(T68=\"\",\"\",LN(V68))","v":""},"","",{"$f":"IF(T68=\"\",\"\",LN(Y68))","v":""},{"$f":"IF(W68=\"\",\"\",W68+Z68)","v":""},"",null,null,{"$f":"IF(Values!$D$26=\"\",\"\",14)","v":""},"","",{"$f":"IF(AF68=\"\",\"\",IF(AE68>COUNT(Values!$D$13:$D$62),0,LN(AG68)))","v":""},{"$f":"IF(AF68=\"\",\"\",LARGE(AG$55:AG$104,AE68))","v":""},{"$f":"IF(AF68=\"\",\"\",IF(AI68=0,0,1-AI68))","v":""},{"$f":"IF(AF68=\"\",\"\",IF(AJ68=0,0,LN(AJ68)))","v":""},{"$f":"IF(AF68=\"\",\"\",AH68+AK68)","v":""},{"$f":"IF(AE68=\"\",\"\",(1-2*AE68)/COUNT($AE$55:$AE$104))","v":""},null,null,null,null,null,null,null,null,null,null,null,"","","","","","","","","",null,null,null,null,null,null,null,null,{"$f":"IF(Values!C47=\"\",\"\",SMALL(Values!$D$13:$D$62,Values!C47))","v":""},{"$f":"IF(Values!D47=\"\",\"\",NORMSINV((Values!C47-0.3)/(COUNT($BP$34:$BP$83))))","v":""},null,null,null,null,"","",null,null,null,null,"",{"$f":"IF(BP68=\"\",\"\",_xlfn.NORM.S.INV((Values!C47-0.5)/Calculation!$DW$8))","v":""},null,null,null,null,"",{"$f":"IF(Values!D47=\"\",\"\",NORMSINV((Values!C47-0.3)/(COUNT($CH$34:$CH$83))))","v":""},null,null,null,null,"",{"$f":"IF(BP68=\"\",\"\",LN(LN(1/(1-((Values!C47-0.5)/$EI$8)))))","v":""},null,null,null,null,null,null,null,null,null,null,null,null,null,null,null,null,null,null,null,null,null,null,null,null,null,null,null,null,null,null,null,null,null,null,null,null,null,null,null,null,null,null,null,null,null,null,null,null,null,null,"","","","","",{"$f":"IF(ER68=\"\",\"\",LN(_xlfn.NUMBERVALUE(Visualization!$L$20)))","v":""},{"$f":"IF(ER68=\"\",\"\",LN(_xlfn.NUMBERVALUE(Visualization!$L$21)))","v":""},"",{"$f":"IF(EU68=\"\",\"\",IF(Visualization!$F$21=\"\",0,LN(_xlfn.NUMBERVALUE(Visualization!$F$21))))","v":""},null,"",{"$f":"IF(EN14=\"\",\"\",IF(EY12>99.98,\"\",NORMDIST(EN13,Visualization!$F$51,Visualization!$F$53,1)*100))","v":""}]
[null,null,null,null,null,null,null,null,{"$f":"IF(Values!$D$27=\"\",\"\",15)","v":""},"",{"$f":"IF(J69=\"\",\"\",NORMDIST(J69,Visualization!$F$51,Visualization!$F$53,TRUE))","v":""},{"$f":"IF(J69=\"\",\"\",IF(I69>COUNT(Values!$D$13:$D$62),0,LN(K69)))","v":""},"","","","","",null,null,"","","","","","","","","",null,null,{"$f":"IF(Values!$D$27=\"\",\"\",15)","v":""},"","",{"$f":"IF(AF69=\"\",\"\",IF(AE69>COUNT(Values!$D$13:$D$62),0,LN(AG69)))","v":""},"","","","","",null,null,null,null,null,null,null,null,null,null,null,"","","","","","","","","",null,null,null,null,null,null,null,null,{"$f":"IF(Values!C48=\"\",\"\",SMALL(Values!$D$13:$D$62,Values!C48))","v":""},{"$f":"IF(Values!D48=\"\",\"\",NORMSINV((Values!C48-0.3)/(COUNT($BP$34:$BP$83))))","v":""},null,null,null,null,"","",null,null,null,null,"",{"$f":"IF(BP69=\"\",\"\",_xlfn.NORM.S.INV((Values!C48-0.5)/Calculation!$DW$8))","v":""},null,null,null,null,"",{"$f":"IF(Values!D48=\"\",\"\",NORMSINV((Values!C48-0.3)/(COUNT($CH$34:$CH$83))))","v":""},null,null,null,null,"",{"$f":"IF(BP69=\"\",\"\",LN(LN(1/(1-((Values!C48-0.5)/$EI$8)))))","v":""},null,null,null,null,null,null,null,null,null,null,null,null,null,null,null,null,null,null,null,null,null,null,null,null,null,null,null,null,null,null,null,null,null,null,null,null,null,null,null,null,null,null,null,null,null,null,null,null,null,null,"","","","","",{"$f":"IF(ER69=\"\",\"\",LN(_xlfn.NUMBERVALUE(Visualization!$L$20)))","v":""},{"$f":"IF(ER69=\"\",\"\",LN(_xlfn.NUMBERVALUE(Visualization!$L$21)))","v":""},"",{"$f":"IF(EU69=\"\",\"\",IF(Visualization!$F$21=\"\",0,LN(_xlfn.NUMBERVALUE(Visualization!$F$21))))","v":""},null,"",{"$f":"IF(EN15=\"\",\"\",IF(EY13>99.98,\"\",NORMDIST(EN14,Visualization!$F$51,Visualization!$F$53,1)*100))","v":""}]
[null,null,null,null,null,null,null,null,{"$f":"IF(Values!$D$28=\"\",\"\",16)","v":""},"",{"$f":"IF(J70=\"\",\"\",NORMDIST(J70,Visualization!$F$51,Visualization!$F$53,TRUE))","v":""},{"$f":"IF(J70=\"\",\"\",IF(I70>COUNT(Values!$D$13:$D$62),0,LN(K70)))","v":""},"","","","","",null,null,"","","","","","","","","",null,null,{"$f":"IF(Values!$D$28=\"\",\"\",16)","v":""},"","",{"$f":"IF(AF70=\"\",\"\",IF(AE70>COUNT(Values!$D$13:$D$62),0,LN(AG70)))","v":""},"","","","","",null,null,null,null,null,null,null,null,null,null,null,"","","","","","","","","",null,null,null,null,null,null,null,null,{"$f":"IF(Values!C49=\"\",\"\",SMALL(Values!$D$13:$D$62,Values!C49))","v":""},{"$f":"IF(Values!D49=\"\",\"\",NORMSINV((Values!C49-0.3)/(COUNT($BP$34:$BP$83))))","v":""},null,null,null,null,"","",null,null,null,null,"",{"$f":"IF(BP70=\"\",\"\",_xlfn.NORM.S.INV((Values!C49-0.5)/Calculation!$DW$8))","v":""},null,null,null,null,"",{"$f":"IF(Values!D49=\"\",\"\",NORMSINV((Values!C49-0.3)/(COUNT($CH$34:$CH$83))))","v":""},null,null,null,null,"",{"$f":"IF(BP70=\"\",\"\",LN(LN(1/(1-((Values!C49-0.5)/$EI$8)))))","v":""},null,null,null,null,null,null,null,null,null,null,null,null,null,null,null,null,null,null,null,null,null,null,null,null,null,null,null,null,null,null,null,null,null,null,null,null,null,null,null,null,null,null,null,null,null,null,null,null,null,null,"","","","","",{"$f":"IF(ER70=\"\",\"\",LN(_xlfn.NUMBERVALUE(Visualization!$L$20)))","v":""},{"$f":"IF(ER70=\"\",\"\",LN(_xlfn.NUMBERVALUE(Visualization!$L$21)))","v":""},"",{"$f":"IF(EU70=\"\",\"\",IF(Visualization!$F$21=\"\",0,LN(_xlfn.NUMBERVALUE(Visualization!$F$21))))","v":""},null,"",{"$f":"IF(EN16=\"\",\"\",IF(EY14>99.98,\"\",NORMDIST(EN15,Visualization!$F$51,Visualization!$F$53,1)*100))","v":""}]
[null,null,null,null,null,null,null,null,{"$f":"IF(Values!$D$29=\"\",\"\",17)","v":""},"",{"$f":"IF(J71=\"\",\"\",NORMDIST(J71,Visualization!$F$51,Visualization!$F$53,TRUE))","v":""},{"$f":"IF(J71=\"\",\"\",IF(I71>COUNT(Values!$D$13:$D$62),0,LN(K71)))","v":""},"","","","","",null,null,"","","","","","","","","",null,null,{"$f":"IF(Values!$D$29=\"\",\"\",17)","v":""},"","",{"$f":"IF(AF71=\"\",\"\",IF(AE71>COUNT(Values!$D$13:$D$62),0,LN(AG71)))","v":""},"","","","","",null,null,null,null,null,null,null,null,null,null,null,"","","","","","","","","",null,null,null,null,null,null,null,null,{"$f":"IF(Values!C50=\"\",\"\",SMALL(Values!$D$13:$D$62,Values!C50))","v":""},{"$f":"IF(Values!D50=\"\",\"\",NORMSINV((Values!C50-0.3)/(COUNT($BP$34:$BP$83))))","v":""},null,null,null,null,"","",null,null,null,null,"",{"$f":"IF(BP71=\"\",\"\",_xlfn.NORM.S.INV((Values!C50-0.5)/Calculation!$DW$8))","v":""},null,null,null,null,"",{"$f":"IF(Values!D50=\"\",\"\",NORMSINV((Values!C50-0.3)/(COUNT($CH$34:$CH$83))))","v":""},null,null,null,null,"",{"$f":"IF(BP71=\"\",\"\",LN(LN(1/(1-((Values!C50-0.5)/$EI$8)))))","v":""},null,null,null,null,null,null,null,null,null,null,null,null,null,null,null,null,null,null,null,null,null,null,null,null,null,null,null,null,null,null,null,null,null,null,null,null,null,null,null,null,null,null,null,null,null,null,null,null,null,null,"","","","","",{"$f":"IF(ER71=\"\",\"\",LN(_xlfn.NUMBERVALUE(Visualization!$L$20)))","v":""},{"$f":"IF(ER71=\"\",\"\",LN(_xlfn.NUMBERVALUE(Visualization!$L$21)))","v":""},"",{"$f":"IF(EU71=\"\",\"\",IF(Visualization!$F$21=\"\",0,LN(_xlfn.NUMBERVALUE(Visualization!$F$21))))","v":""},null,"",{"$f":"IF(EN17=\"\",\"\",IF(EY15>99.98,\"\",NORMDIST(EN16,Visualization!$F$51,Visualization!$F$53,1)*100))","v":""}]
[null,null,null,null,null,null,null,null,{"$f":"IF(Values!$D$30=\"\",\"\",18)","v":""},"",{"$f":"IF(J72=\"\",\"\",NORMDIST(J72,Visualization!$F$51,Visualization!$F$53,TRUE))","v":""},{"$f":"IF(J72=\"\",\"\",IF(I72>COUNT(Values!$D$13:$D$62),0,LN(K72)))","v":""},"","","","","",null,null,"","","","","","","","","",null,null,{"$f":"IF(Values!$D$30=\"\",\"\",18)","v":""},"","",{"$f":"IF(AF72=\"\",\"\",IF(AE72>COUNT(Values!$D$13:$D$62),0,LN(AG72)))","v":""},"","","","","",null,null,null,null,null,null,null,null,null,null,null,"","","","","","","","","",null,null,null,null,null,null,null,null,{"$f":"IF(Values!C51=\"\",\"\",SMALL(Values!$D$13:$D$62,Values!C51))","v":""},{"$f":"IF(Values!D51=\"\",\"\",NORMSINV((Values!C51-0.3)/(COUNT($BP$34:$BP$83))))","v":""},null,null,null,null,"","",null,null,null,null,"",{"$f":"IF(BP72=\"\",\"\",_xlfn.NORM.S.INV((Values!C51-0.5)/Calculation!$DW$8))","v":""},null,null,null,null,"",{"$f":"IF(Values!D51=\"\",\"\",NORMSINV((Values!C51-0.3)/(COUNT($CH$34:$CH$83))))","v":""},null,null,null,null,"",{"$f":"IF(BP72=\"\",\"\",LN(LN(1/(1-((Values!C51-0.5)/$EI$8)))))","v":""},null,null,null,null,null,null,null,null,null,null,null,null,null,null,null,null,null,null,null,null,null,null,null,null,null,null,null,null,null,null,null,null,null,null,null,null,null,null,null,null,null,null,null,null,null,null,null,null,null,null,"","","","","",{"$f":"IF(ER72=\"\",\"\",LN(_xlfn.NUMBERVALUE(Visualization!$L$20)))","v":""},{"$f":"IF(ER72=\"\",\"\",LN(_xlfn.NUMBERVALUE(Visualization!$L$21)))","v":""},"",{"$f":"IF(EU72=\"\",\"\",IF(Visualization!$F$21=\"\",0,LN(_xlfn.NUMBERVALUE(Visualization!$F$21))))","v":""},null,"",{"$f":"IF(EN18=\"\",\"\",IF(EY16>99.98,\"\",NORMDIST(EN17,Visualization!$F$51,Visualization!$F$53,1)*100))","v":""}]
[null,null,null,null,null,null,null,null,{"$f":"IF(Values!$D$31=\"\",\"\",19)","v":""},"",{"$f":"IF(J73=\"\",\"\",NORMDIST(J73,Visualization!$F$51,Visualization!$F$53,TRUE))","v":""},{"$f":"IF(J73=\"\",\"\",IF(I73>COUNT(Values!$D$13:$D$62),0,LN(K73)))","v":""},"","","","","",null,null,"","","","","","","","","",null,null,{"$f":"IF(Values!$D$31=\"\",\"\",19)","v":""},"","",{"$f":"IF(AF73=\"\",\"\",IF(AE73>COUNT(Values!$D$13:$D$62),0,LN(AG73)))","v":""},"","","","","",null,null,null,null,null,null,null,null,null,null,null,"","","","","","","","","",null,null,null,null,null,null,null,null,{"$f":"IF(Values!C52=\"\",\"\",SMALL(Values!$D$13:$D$62,Values!C52))","v":""},{"$f":"IF(Values!D52=\"\",\"\",NORMSINV((Values!C52-0.3)/(COUNT($BP$34:$BP$83))))","v":""},null,null,null,null,"","",null,null,null,null,"",{"$f":"IF(BP73=\"\",\"\",_xlfn.NORM.S.INV((Values!C52-0.5)/Calculation!$DW$8))","v":""},null,null,null,null,"",{"$f":"IF(Values!D52=\"\",\"\",NORMSINV((Values!C52-0.3)/(COUNT($CH$34:$CH$83))))","v":""},null,null,null,null,"",{"$f":"IF(BP73=\"\",\"\",LN(LN(1/(1-((Values!C52-0.5)/$EI$8)))))","v":""},null,null,null,null,null,null,null,null,null,null,null,null,null,null,null,null,null,null,null,null,null,null,null,null,null,null,null,null,null,null,null,null,null,null,null,null,null,null,null,null,null,null,null,null,null,null,null,null,null,null,"","","","","",{"$f":"IF(ER73=\"\",\"\",LN(_xlfn.NUMBERVALUE(Visualization!$L$20)))","v":""},{"$f":"IF(ER73=\"\",\"\",LN(_xlfn.NUMBERVALUE(Visualization!$L$21)))","v":""},"",{"$f":"IF(EU73=\"\",\"\",IF(Visualization!$F$21=\"\",0,LN(_xlfn.NUMBERVALUE(Visualization!$F$21))))","v":""},null,"",{"$f":"IF(EN19=\"\",\"\",IF(EY17>99.98,\"\",NORMDIST(EN18,Visualization!$F$51,Visualization!$F$53,1)*100))","v":""}]
[null,null,null,null,null,null,null,null,{"$f":"IF(Values!$D$32=\"\",\"\",20)","v":""},"",{"$f":"IF(J74=\"\",\"\",NORMDIST(J74,Visualization!$F$51,Visualization!$F$53,TRUE))","v":""},{"$f":"IF(J74=\"\",\"\",IF(I74>COUNT(Values!$D$13:$D$62),0,LN(K74)))","v":""},"","","","","",null,null,"","","","","","","","","",null,null,{"$f":"IF(Values!$D$32=\"\",\"\",20)","v":""},"","",{"$f":"IF(AF74=\"\",\"\",IF(AE74>COUNT(Values!$D$13:$D$62),0,LN(AG74)))","v":""},"","","","","",null,null,null,null,null,null,null,null,null,null,null,"","","","","","","","","",null,null,null,null,null,null,null,null,{"$f":"IF(Values!C53=\"\",\"\",SMALL(Values!$D$13:$D$62,Values!C53))","v":""},{"$f":"IF(Values!D53=\"\",\"\",NORMSINV((Values!C53-0.3)/(COUNT($BP$34:$BP$83))))","v":""},null,null,null,null,"","",null,null,null,null,"",{"$f":"IF(BP74=\"\",\"\",_xlfn.NORM.S.INV((Values!C53-0.5)/Calculation!$DW$8))","v":""},null,null,null,null,"",{"$f":"IF(Values!D53=\"\",\"\",NORMSINV((Values!C53-0.3)/(COUNT($CH$34:$CH$83))))","v":""},null,null,null,null,"",{"$f":"IF(BP74=\"\",\"\",LN(LN(1/(1-((Values!C53-0.5)/$EI$8)))))","v":""},null,null,null,null,null,null,null,null,null,null,null,null,null,null,null,null,null,null,null,null,null,null,null,null,null,null,null,null,null,null,null,null,null,null,null,null,null,null,null,null,null,null,null,null,null,null,null,null,null,null,"","","","","",{"$f":"IF(ER74=\"\",\"\",LN(_xlfn.NUMBERVALUE(Visualization!$L$20)))","v":""},{"$f":"IF(ER74=\"\",\"\",LN(_xlfn.NUMBERVALUE(Visualization!$L$21)))","v":""},"",{"$f":"IF(EU74=\"\",\"\",IF(Visualization!$F$21=\"\",0,LN(_xlfn.NUMBERVALUE(Visualization!$F$21))))","v":""},null,"",{"$f":"IF(EN20=\"\",\"\",IF(EY18>99.98,\"\",NORMDIST(EN19,Visualization!$F$51,Visualization!$F$53,1)*100))","v":""}]
[null,null,null,null,null,null,null,null,{"$f":"IF(Values!$D$33=\"\",\"\",21)","v":""},"",{"$f":"IF(J75=\"\",\"\",NORMDIST(J75,Visualization!$F$51,Visualization!$F$53,TRUE))","v":""},{"$f":"IF(J75=\"\",\"\",IF(I75>COUNT(Values!$D$13:$D$62),0,LN(K75)))","v":""},"","","","","",null,null,"","","","","","","","","",null,null,{"$f":"IF(Values!$D$33=\"\",\"\",21)","v":""},"","",{"$f":"IF(AF75=\"\",\"\",IF(AE75>COUNT(Values!$D$13:$D$62),0,LN(AG75)))","v":""},"","","","","",null,null,null,null,null,null,null,null,null,null,null,"","","","","","","","","",null,null,null,null,null,null,null,null,{"$f":"IF(Values!C54=\"\",\"\",SMALL(Values!$D$13:$D$62,Values!C54))","v":""},{"$f":"IF(Values!D54=\"\",\"\",NORMSINV((Values!C54-0.3)/(COUNT($BP$34:$BP$83))))","v":""},null,null,null,null,"","",null,null,null,null,"",{"$f":"IF(BP75=\"\",\"\",_xlfn.NORM.S.INV((Values!C54-0.5)/Calculation!$DW$8))","v":""},null,null,null,null,"",{"$f":"IF(Values!D54=\"\",\"\",NORMSINV((Values!C54-0.3)/(COUNT($CH$34:$CH$83))))","v":""},null,null,null,null,"",{"$f":"IF(BP75=\"\",\"\",LN(LN(1/(1-((Values!C54-0.5)/$EI$8)))))","v":""},null,null,null,null,null,null,null,null,null,null,null,null,null,null,null,null,null,null,null,null,null,null,null,null,null,null,null,null,null,null,null,null,null,null,null,null,null,null,null,null,null,null,null,null,null,null,null,null,null,null,"","","","","",{"$f":"IF(ER75=\"\",\"\",LN(_xlfn.NUMBERVALUE(Visualization!$L$20)))","v":""},{"$f":"IF(ER75=\"\",\"\",LN(_xlfn.NUMBERVALUE(Visualization!$L$21)))","v":""},"",{"$f":"IF(EU75=\"\",\"\",IF(Visualization!$F$21=\"\",0,LN(_xlfn.NUMBERVALUE(Visualization!$F$21))))","v":""},null,"",{"$f":"IF(EN21=\"\",\"\",IF(EY19>99.98,\"\",NORMDIST(EN20,Visualization!$F$51,Visualization!$F$53,1)*100))","v":""}]
[null,null,null,null,null,null,null,null,{"$f":"IF(Values!$D$34=\"\",\"\",22)","v":""},"",{"$f":"IF(J76=\"\",\"\",NORMDIST(J76,Visualization!$F$51,Visualization!$F$53,TRUE))","v":""},{"$f":"IF(J76=\"\",\"\",IF(I76>COUNT(Values!$D$13:$D$62),0,LN(K76)))","v":""},"","","","","",null,null,"","","","","","","","","",null,null,{"$f":"IF(Values!$D$34=\"\",\"\",22)","v":""},"","",{"$f":"IF(AF76=\"\",\"\",IF(AE76>COUNT(Values!$D$13:$D$62),0,LN(AG76)))","v":""},"","","","","",null,null,null,null,null,null,null,null,null,null,null,"","","","","","","","","",null,null,null,null,null,null,null,null,{"$f":"IF(Values!C55=\"\",\"\",SMALL(Values!$D$13:$D$62,Values!C55))","v":""},{"$f":"IF(Values!D55=\"\",\"\",NORMSINV((Values!C55-0.3)/(COUNT($BP$34:$BP$83))))","v":""},null,null,null,null,"","",null,null,null,null,"",{"$f":"IF(BP76=\"\",\"\",_xlfn.NORM.S.INV((Values!C55-0.5)/Calculation!$DW$8))","v":""},null,null,null,null,"",{"$f":"IF(Values!D55=\"\",\"\",NORMSINV((Values!C55-0.3)/(COUNT($CH$34:$CH$83))))","v":""},null,null,null,null,"",{"$f":"IF(BP76=\"\",\"\",LN(LN(1/(1-((Values!C55-0.5)/$EI$8)))))","v":""},null,null,null,null,null,null,null,null,null,null,null,null,null,null,null,null,null,null,null,null,null,null,null,null,null,null,null,null,null,null,null,null,null,null,null,null,null,null,null,null,null,null,null,null,null,null,null,null,null,null,"","","","","",{"$f":"IF(ER76=\"\",\"\",LN(_xlfn.NUMBERVALUE(Visualization!$L$20)))","v":""},{"$f":"IF(ER76=\"\",\"\",LN(_xlfn.NUMBERVALUE(Visualization!$L$21)))","v":""},"",{"$f":"IF(EU76=\"\",\"\",IF(Visualization!$F$21=\"\",0,LN(_xlfn.NUMBERVALUE(Visualization!$F$21))))","v":""},null,"",{"$f":"IF(EN22=\"\",\"\",IF(EY20>99.98,\"\",NORMDIST(EN21,Visualization!$F$51,Visualization!$F$53,1)*100))","v":""}]
[null,null,null,null,null,null,null,null,{"$f":"IF(Values!$D$35=\"\",\"\",23)","v":""},"",{"$f":"IF(J77=\"\",\"\",NORMDIST(J77,Visualization!$F$51,Visualization!$F$53,TRUE))","v":""},{"$f":"IF(J77=\"\",\"\",IF(I77>COUNT(Values!$D$13:$D$62),0,LN(K77)))","v":""},"","","","","",null,null,"","","","","","","","","",null,null,{"$f":"IF(Values!$D$35=\"\",\"\",23)","v":""},"","",{"$f":"IF(AF77=\"\",\"\",IF(AE77>COUNT(Values!$D$13:$D$62),0,LN(AG77)))","v":""},"","","","","",null,null,null,null,null,null,null,null,null,null,null,"","","","","","","","","",null,null,null,null,null,null,null,null,{"$f":"IF(Values!C56=\"\",\"\",SMALL(Values!$D$13:$D$62,Values!C56))","v":""},{"$f":"IF(Values!D56=\"\",\"\",NORMSINV((Values!C56-0.3)/(COUNT($BP$34:$BP$83))))","v":""},null,null,null,null,"","",null,null,null,null,"",{"$f":"IF(BP77=\"\",\"\",_xlfn.NORM.S.INV((Values!C56-0.5)/Calculation!$DW$8))","v":""},null,null,null,null,"",{"$f":"IF(Values!D56=\"\",\"\",NORMSINV((Values!C56-0.3)/(COUNT($CH$34:$CH$83))))","v":""},null,null,null,null,"",{"$f":"IF(BP77=\"\",\"\",LN(LN(1/(1-((Values!C56-0.5)/$EI$8)))))","v":""},null,null,null,null,null,null,null,null,null,null,null,null,null,null,null,null,null,null,null,null,null,null,null,null,null,null,null,null,null,null,null,null,null,null,null,null,null,null,null,null,null,null,null,null,null,null,null,null,null,null,"","","","","",{"$f":"IF(ER77=\"\",\"\",LN(_xlfn.NUMBERVALUE(Visualization!$L$20)))","v":""},{"$f":"IF(ER77=\"\",\"\",LN(_xlfn.NUMBERVALUE(Visualization!$L$21)))","v":""},"",{"$f":"IF(EU77=\"\",\"\",IF(Visualization!$F$21=\"\",0,LN(_xlfn.NUMBERVALUE(Visualization!$F$21))))","v":""},null,"",{"$f":"IF(EN23=\"\",\"\",IF(EY21>99.98,\"\",NORMDIST(EN22,Visualization!$F$51,Visualization!$F$53,1)*100))","v":""}]
[null,null,null,null,null,null,null,null,{"$f":"IF(Values!$D$36=\"\",\"\",24)","v":""},"",{"$f":"IF(J78=\"\",\"\",NORMDIST(J78,Visualization!$F$51,Visualization!$F$53,TRUE))","v":""},{"$f":"IF(J78=\"\",\"\",IF(I78>COUNT(Values!$D$13:$D$62),0,LN(K78)))","v":""},"","","","","",null,null,"","","","","","","","","",null,null,{"$f":"IF(Values!$D$36=\"\",\"\",24)","v":""},"","",{"$f":"IF(AF78=\"\",\"\",IF(AE78>COUNT(Values!$D$13:$D$62),0,LN(AG78)))","v":""},"","","","","",null,null,null,null,null,null,null,null,null,null,null,"","","","","","","","","",null,null,null,null,null,null,null,null,{"$f":"IF(Values!C57=\"\",\"\",SMALL(Values!$D$13:$D$62,Values!C57))","v":""},{"$f":"IF(Values!D57=\"\",\"\",NORMSINV((Values!C57-0.3)/(COUNT($BP$34:$BP$83))))","v":""},null,null,null,null,"","",null,null,null,null,"",{"$f":"IF(BP78=\"\",\"\",_xlfn.NORM.S.INV((Values!C57-0.5)/Calculation!$DW$8))","v":""},null,null,null,null,"",{"$f":"IF(Values!D57=\"\",\"\",NORMSINV((Values!C57-0.3)/(COUNT($CH$34:$CH$83))))","v":""},null,null,null,null,"",{"$f":"IF(BP78=\"\",\"\",LN(LN(1/(1-((Values!C57-0.5)/$EI$8)))))","v":""},null,null,null,null,null,null,null,null,null,null,null,null,null,null,null,null,null,null,null,null,null,null,null,null,null,null,null,null,null,null,null,null,null,null,null,null,null,null,null,null,null,null,null,null,null,null,null,null,null,null,"","","","","",{"$f":"IF(ER78=\"\",\"\",LN(_xlfn.NUMBERVALUE(Visualization!$L$20)))","v":""},{"$f":"IF(ER78=\"\",\"\",LN(_xlfn.NUMBERVALUE(Visualization!$L$21)))","v":""},"",{"$f":"IF(EU78=\"\",\"\",IF(Visualization!$F$21=\"\",0,LN(_xlfn.NUMBERVALUE(Visualization!$F$21))))","v":""},null,"",{"$f":"IF(EN24=\"\",\"\",IF(EY22>99.98,\"\",NORMDIST(EN23,Visualization!$F$51,Visualization!$F$53,1)*100))","v":""}]
[null,null,null,null,null,null,null,null,{"$f":"IF(Values!$D$37=\"\",\"\",25)","v":""},"",{"$f":"IF(J79=\"\",\"\",NORMDIST(J79,Visualization!$F$51,Visualization!$F$53,TRUE))","v":""},{"$f":"IF(J79=\"\",\"\",IF(I79>COUNT(Values!$D$13:$D$62),0,LN(K79)))","v":""},"","","","","",null,null,"","","","","","","","","",null,null,{"$f":"IF(Values!$D$37=\"\",\"\",25)","v":""},"","",{"$f":"IF(AF79=\"\",\"\",IF(AE79>COUNT(Values!$D$13:$D$62),0,LN(AG79)))","v":""},"","","","","",null,null,null,null,null,null,null,null,null,null,null,"","","","","","","","","",null,null,null,null,null,null,null,null,{"$f":"IF(Values!C58=\"\",\"\",SMALL(Values!$D$13:$D$62,Values!C58))","v":""},{"$f":"IF(Values!D58=\"\",\"\",NORMSINV((Values!C58-0.3)/(COUNT($BP$34:$BP$83))))","v":""},null,null,null,null,"","",null,null,null,null,"",{"$f":"IF(BP79=\"\",\"\",_xlfn.NORM.S.INV((Values!C58-0.5)/Calculation!$DW$8))","v":""},null,null,null,null,"",{"$f":"IF(Values!D58=\"\",\"\",NORMSINV((Values!C58-0.3)/(COUNT($CH$34:$CH$83))))","v":""},null,null,null,null,"",{"$f":"IF(BP79=\"\",\"\",LN(LN(1/(1-((Values!C58-0.5)/$EI$8)))))","v":""},null,null,null,null,null,null,null,null,null,null,null,null,null,null,null,null,null,null,null,null,null,null,null,null,null,null,null,null,null,null,null,null,null,null,null,null,null,null,null,null,null,null,null,null,null,null,null,null,null,null,"","","","","",{"$f":"IF(ER79=\"\",\"\",LN(_xlfn.NUMBERVALUE(Visualization!$L$20)))","v":""},{"$f":"IF(ER79=\"\",\"\",LN(_xlfn.NUMBERVALUE(Visualization!$L$21)))","v":""},"",{"$f":"IF(EU79=\"\",\"\",IF(Visualization!$F$21=\"\",0,LN(_xlfn.NUMBERVALUE(Visualization!$F$21))))","v":""},null,"",{"$f":"IF(EN25=\"\",\"\",IF(EY23>99.98,\"\",NORMDIST(EN24,Visualization!$F$51,Visualization!$F$53,1)*100))","v":""}]
[null,null,null,null,null,null,null,null,{"$f":"IF(Values!$D$38=\"\",\"\",26)","v":""},"",{"$f":"IF(J80=\"\",\"\",NORMDIST(J80,Visualization!$F$51,Visualization!$F$53,TRUE))","v":""},{"$f":"IF(J80=\"\",\"\",IF(I80>COUNT(Values!$D$13:$D$62),0,LN(K80)))","v":""},"","","","","",null,null,"","","","","","","","","",null,null,{"$f":"IF(Values!$D$38=\"\",\"\",26)","v":""},"","",{"$f":"IF(AF80=\"\",\"\",IF(AE80>COUNT(Values!$D$13:$D$62),0,LN(AG80)))","v":""},"","","","","",null,null,null,null,null,null,null,null,null,null,null,"","","","","","","","","",null,null,null,null,null,null,null,null,{"$f":"IF(Values!C59=\"\",\"\",SMALL(Values!$D$13:$D$62,Values!C59))","v":""},{"$f":"IF(Values!D59=\"\",\"\",NORMSINV((Values!C59-0.3)/(COUNT($BP$34:$BP$83))))","v":""},null,null,null,null,"","",null,null,null,null,"",{"$f":"IF(BP80=\"\",\"\",_xlfn.NORM.S.INV((Values!C59-0.5)/Calculation!$DW$8))","v":""},null,null,null,null,"",{"$f":"IF(Values!D59=\"\",\"\",NORMSINV((Values!C59-0.3)/(COUNT($CH$34:$CH$83))))","v":""},null,null,null,null,"",{"$f":"IF(BP80=\"\",\"\",LN(LN(1/(1-((Values!C59-0.5)/$EI$8)))))","v":""},null,null,null,null,null,null,null,null,null,null,null,null,null,null,null,null,null,null,null,null,null,null,null,null,null,null,null,null,null,null,null,null,null,null,null,null,null,null,null,null,null,null,null,null,null,null,null,null,null,null,"","","","","",{"$f":"IF(ER80=\"\",\"\",LN(_xlfn.NUMBERVALUE(Visualization!$L$20)))","v":""},{"$f":"IF(ER80=\"\",\"\",LN(_xlfn.NUMBERVALUE(Visualization!$L$21)))","v":""},"",{"$f":"IF(EU80=\"\",\"\",IF(Visualization!$F$21=\"\",0,LN(_xlfn.NUMBERVALUE(Visualization!$F$21))))","v":""},null,"",{"$f":"IF(EN26=\"\",\"\",IF(EY24>99.98,\"\",NORMDIST(EN25,Visualization!$F$51,Visualization!$F$53,1)*100))","v":""}]
[null,null,null,null,null,null,null,null,{"$f":"IF(Values!$D$39=\"\",\"\",27)","v":""},"",{"$f":"IF(J81=\"\",\"\",NORMDIST(J81,Visualization!$F$51,Visualization!$F$53,TRUE))","v":""},{"$f":"IF(J81=\"\",\"\",IF(I81>COUNT(Values!$D$13:$D$62),0,LN(K81)))","v":""},"","","","","",null,null,"","","","","","","","","",null,null,{"$f":"IF(Values!$D$39=\"\",\"\",27)","v":""},"","",{"$f":"IF(AF81=\"\",\"\",IF(AE81>COUNT(Values!$D$13:$D$62),0,LN(AG81)))","v":""},"","","","","",null,null,null,null,null,null,null,null,null,null,null,"","","","","","","","","",null,null,null,null,null,null,null,null,{"$f":"IF(Values!C60=\"\",\"\",SMALL(Values!$D$13:$D$62,Values!C60))","v":""},{"$f":"IF(Values!D60=\"\",\"\",NORMSINV((Values!C60-0.3)/(COUNT($BP$34:$BP$83))))","v":""},null,null,null,null,"","",null,null,null,null,"",{"$f":"IF(BP81=\"\",\"\",_xlfn.NORM.S.INV((Values!C60-0.5)/Calculation!$DW$8))","v":""},null,null,null,null,"",{"$f":"IF(Values!D60=\"\",\"\",NORMSINV((Values!C60-0.3)/(COUNT($CH$34:$CH$83))))","v":""},null,null,null,null,"",{"$f":"IF(BP81=\"\",\"\",LN(LN(1/(1-((Values!C60-0.5)/$EI$8)))))","v":""},null,null,null,null,null,null,null,null,null,null,null,null,null,null,null,null,null,null,null,null,null,null,null,null,null,null,null,null,null,null,null,null,null,null,null,null,null,null,null,null,null,null,null,null,null,null,null,null,null,null,"","","","","",{"$f":"IF(ER81=\"\",\"\",LN(_xlfn.NUMBERVALUE(Visualization!$L$20)))","v":""},{"$f":"IF(ER81=\"\",\"\",LN(_xlfn.NUMBERVALUE(Visualization!$L$21)))","v":""},"",{"$f":"IF(EU81=\"\",\"\",IF(Visualization!$F$21=\"\",0,LN(_xlfn.NUMBERVALUE(Visualization!$F$21))))","v":""},null,"",{"$f":"IF(EN27=\"\",\"\",IF(EY25>99.98,\"\",NORMDIST(EN26,Visualization!$F$51,Visualization!$F$53,1)*100))","v":""}]
[null,null,null,null,null,null,null,null,{"$f":"IF(Values!$D$40=\"\",\"\",28)","v":""},"",{"$f":"IF(J82=\"\",\"\",NORMDIST(J82,Visualization!$F$51,Visualization!$F$53,TRUE))","v":""},{"$f":"IF(J82=\"\",\"\",IF(I82>COUNT(Values!$D$13:$D$62),0,LN(K82)))","v":""},"","","","","",null,null,"","","","","","","","","",null,null,{"$f":"IF(Values!$D$40=\"\",\"\",28)","v":""},"","",{"$f":"IF(AF82=\"\",\"\",IF(AE82>COUNT(Values!$D$13:$D$62),0,LN(AG82)))","v":""},"","","","","",null,null,null,null,null,null,null,null,null,null,null,"","","","","","","","","",null,null,null,null,null,null,null,null,{"$f":"IF(Values!C61=\"\",\"\",SMALL(Values!$D$13:$D$62,Values!C61))","v":""},{"$f":"IF(Values!D61=\"\",\"\",NORMSINV((Values!C61-0.3)/(COUNT($BP$34:$BP$83))))","v":""},null,null,null,null,"","",null,null,null,null,"",{"$f":"IF(BP82=\"\",\"\",_xlfn.NORM.S.INV((Values!C61-0.5)/Calculation!$DW$8))","v":""},null,null,null,null,"",{"$f":"IF(Values!D61=\"\",\"\",NORMSINV((Values!C61-0.3)/(COUNT($CH$34:$CH$83))))","v":""},null,null,null,null,"",{"$f":"IF(BP82=\"\",\"\",LN(LN(1/(1-((Values!C61-0.5)/$EI$8)))))","v":""},null,null,null,null,null,null,null,null,null,null,null,null,null,null,null,null,null,null,null,null,null,null,null,null,null,null,null,null,null,null,null,null,null,null,null,null,null,null,null,null,null,null,null,null,null,null,null,null,null,null,"","","","","",{"$f":"IF(ER82=\"\",\"\",LN(_xlfn.NUMBERVALUE(Visualization!$L$20)))","v":""},{"$f":"IF(ER82=\"\",\"\",LN(_xlfn.NUMBERVALUE(Visualization!$L$21)))","v":""},"",{"$f":"IF(EU82=\"\",\"\",IF(Visualization!$F$21=\"\",0,LN(_xlfn.NUMBERVALUE(Visualization!$F$21))))","v":""},null,"",{"$f":"IF(EN28=\"\",\"\",IF(EY26>99.98,\"\",NORMDIST(EN27,Visualization!$F$51,Visualization!$F$53,1)*100))","v":""}]
[null,null,null,null,null,null,null,null,{"$f":"IF(Values!$D$41=\"\",\"\",29)","v":""},"",{"$f":"IF(J83=\"\",\"\",NORMDIST(J83,Visualization!$F$51,Visualization!$F$53,TRUE))","v":""},{"$f":"IF(J83=\"\",\"\",IF(I83>COUNT(Values!$D$13:$D$62),0,LN(K83)))","v":""},"","","","","",null,null,"","","","","","","","","",null,null,{"$f":"IF(Values!$D$41=\"\",\"\",29)","v":""},"","",{"$f":"IF(AF83=\"\",\"\",IF(AE83>COUNT(Values!$D$13:$D$62),0,LN(AG83)))","v":""},"","","","","",null,null,null,null,null,null,null,null,null,null,null,"","","","","","","","","",null,null,null,null,null,null,null,null,{"$f":"IF(Values!C62=\"\",\"\",SMALL(Values!$D$13:$D$62,Values!C62))","v":""},{"$f":"IF(Values!D62=\"\",\"\",NORMSINV((Values!C62-0.3)/(COUNT($BP$34:$BP$83))))","v":""},null,null,null,null,"","",null,null,null,null,"",{"$f":"IF(BP83=\"\",\"\",_xlfn.NORM.S.INV((Values!C62-0.5)/Calculation!$DW$8))","v":""},null,null,null,null,"",{"$f":"IF(Values!D62=\"\",\"\",NORMSINV((Values!C62-0.3)/(COUNT($CH$34:$CH$83))))","v":""},null,null,null,null,{"$f":"CH83","v":""},{"$f":"IF(BP83=\"\",\"\",LN(LN(1/(1-((Values!C62-0.5)/$EI$8)))))","v":""},null,null,null,null,null,null,null,null,null,null,null,null,null,null,null,null,null,null,null,null,null,null,null,null,null,null,null,null,null,null,null,null,null,null,null,null,null,null,null,null,null,null,null,null,null,null,null,null,null,null,"","","","","",{"$f":"IF(ER83=\"\",\"\",LN(_xlfn.NUMBERVALUE(Visualization!$L$20)))","v":""},{"$f":"IF(ER83=\"\",\"\",LN(_xlfn.NUMBERVALUE(Visualization!$L$21)))","v":""},"",{"$f":"IF(EU83=\"\",\"\",IF(Visualization!$F$21=\"\",0,LN(_xlfn.NUMBERVALUE(Visualization!$F$21))))","v":""},null,"",{"$f":"IF(EN29=\"\",\"\",IF(EY27>99.98,\"\",NORMDIST(EN28,Visualization!$F$51,Visualization!$F$53,1)*100))","v":""}]
[null,null,null,null,null,null,null,null,{"$f":"IF(Values!$D$42=\"\",\"\",30)","v":""},"",{"$f":"IF(J84=\"\",\"\",NORMDIST(J84,Visualization!$F$51,Visualization!$F$53,TRUE))","v":""},{"$f":"IF(J84=\"\",\"\",IF(I84>COUNT(Values!$D$13:$D$62),0,LN(K84)))","v":""},"","","","","",null,null,"","","","","","","","","",null,null,{"$f":"IF(Values!$D$42=\"\",\"\",30)","v":""},"","",{"$f":"IF(AF84=\"\",\"\",IF(AE84>COUNT(Values!$D$13:$D$62),0,LN(AG84)))","v":""},"","","","","",null,null,null,null,null,null,null,null,null,null,null,"","","","","","","","","",null,null,null,null,null,null,null,null,null,null,null,null,null,null,null,null,null,null,null,null,null,null,null,null,null,null,null,null,null,null,null,null,null,null,null,null,null,null,null,null,null,null,null,null,null,null,null,null,null,null,null,null,null,null,null,null,null,null,null,null,null,null,null,null,null,null,null,null,null,null,null,null,null,null,null,null,null,null,null,null,null,null,null,null,"","","","","",{"$f":"IF(ER84=\"\",\"\",LN(_xlfn.NUMBERVALUE(Visualization!$L$20)))","v":""},{"$f":"IF(ER84=\"\",\"\",LN(_xlfn.NUMBERVALUE(Visualization!$L$21)))","v":""},"",{"$f":"IF(EU84=\"\",\"\",IF(Visualization!$F$21=\"\",0,LN(_xlfn.NUMBERVALUE(Visualization!$F$21))))","v":""},null,"",{"$f":"IF(EN30=\"\",\"\",IF(EY28>99.98,\"\",NORMDIST(EN29,Visualization!$F$51,Visualization!$F$53,1)*100))","v":""}]
[null,null,null,null,null,null,null,null,{"$f":"IF(Values!$D$43=\"\",\"\",31)","v":""},"",{"$f":"IF(J85=\"\",\"\",NORMDIST(J85,Visualization!$F$51,Visualization!$F$53,TRUE))","v":""},{"$f":"IF(J85=\"\",\"\",IF(I85>COUNT(Values!$D$13:$D$62),0,LN(K85)))","v":""},"","","","","",null,null,"","","","","","","","","",null,null,{"$f":"IF(Values!$D$43=\"\",\"\",31)","v":""},"","",{"$f":"IF(AF85=\"\",\"\",IF(AE85>COUNT(Values!$D$13:$D$62),0,LN(AG85)))","v":""},"","","","","",null,null,null,null,null,null,null,null,null,null,null,"","","","","","","","","",null,null,null,null,null,null,null,null,null,null,null,null,null,null,null,null,null,null,null,null,null,null,null,null,null,null,null,null,null,null,null,null,null,null,null,null,null,null,null,null,null,null,null,null,null,null,null,null,null,null,null,null,null,null,null,null,null,null,null,null,null,null,null,null,null,null,null,null,null,null,null,null,null,null,null,null,null,null,null,null,null,null,null,null,"","","","","",{"$f":"IF(ER85=\"\",\"\",LN(_xlfn.NUMBERVALUE(Visualization!$L$20)))","v":""},{"$f":"IF(ER85=\"\",\"\",LN(_xlfn.NUMBERVALUE(Visualization!$L$21)))","v":""},"",{"$f":"IF(EU85=\"\",\"\",IF(Visualization!$F$21=\"\",0,LN(_xlfn.NUMBERVALUE(Visualization!$F$21))))","v":""},null,"",{"$f":"IF(EN31=\"\",\"\",IF(EY29>99.98,\"\",NORMDIST(EN30,Visualization!$F$51,Visualization!$F$53,1)*100))","v":""}]
[null,null,null,null,null,null,null,null,{"$f":"IF(Values!$D$44=\"\",\"\",32)","v":""},"",{"$f":"IF(J86=\"\",\"\",NORMDIST(J86,Visualization!$F$51,Visualization!$F$53,TRUE))","v":""},{"$f":"IF(J86=\"\",\"\",IF(I86>COUNT(Values!$D$13:$D$62),0,LN(K86)))","v":""},"","","","","",null,null,"","","","","","","","","",null,null,{"$f":"IF(Values!$D$44=\"\",\"\",32)","v":""},"","",{"$f":"IF(AF86=\"\",\"\",IF(AE86>COUNT(Values!$D$13:$D$62),0,LN(AG86)))","v":""},"","","","","",null,null,null,null,null,null,null,null,null,null,null,"","","","","","","","","",null,null,null,null,null,null,null,null,null,null,null,null,null,null,null,null,null,null,null,null,null,null,null,null,null,null,null,null,null,null,null,null,null,null,null,null,null,null,null,null,null,null,null,null,null,null,null,null,null,null,null,null,null,null,null,null,null,null,null,null,null,null,null,null,null,null,null,null,null,null,null,null,null,null,null,null,null,null,null,null,null,null,null,null,"","","","","",{"$f":"IF(ER86=\"\",\"\",LN(_xlfn.NUMBERVALUE(Visualization!$L$20)))","v":""},{"$f":"IF(ER86=\"\",\"\",LN(_xlfn.NUMBERVALUE(Visualization!$L$21)))","v":""},"",{"$f":"IF(EU86=\"\",\"\",IF(Visualization!$F$21=\"\",0,LN(_xlfn.NUMBERVALUE(Visualization!$F$21))))","v":""},null,"",{"$f":"IF(EN32=\"\",\"\",IF(EY30>99.98,\"\",NORMDIST(EN31,Visualization!$F$51,Visualization!$F$53,1)*100))","v":""}]
[null,null,null,null,null,null,null,null,{"$f":"IF(Values!$D$45=\"\",\"\",33)","v":""},{"$f":"IF(I87=\"\",\"\",SMALL($DA$8:$DA$57,I87))","v":""},{"$f":"IF(J87=\"\",\"\",NORMDIST(J87,Visualization!$F$51,Visualization!$F$53,TRUE))","v":""},{"$f":"IF(J87=\"\",\"\",IF(I87>COUNT(Values!$D$13:$D$62),0,LN(K87)))","v":""},{"$f":"IF(J87=\"\",\"\",LARGE(K$55:K$104,I87))","v":""},"","","",{"$f":"IF(I87=\"\",\"\",(1-2*I87)/COUNT($I$55:$I$104))","v":""},null,null,"","","","","","","","","",null,null,{"$f":"IF(Values!$D$45=\"\",\"\",33)","v":""},{"$f":"IF(AE87=\"\",\"\",SMALL($DB$8:$DB$57,AE87))","v":""},{"$f":"IF(AF87=\"\",\"\",NORMDIST(AF87,$CI$6,$EF$14,TRUE))","v":""},{"$f":"IF(AF87=\"\",\"\",IF(AE87>COUNT(Values!$D$13:$D$62),0,LN(AG87)))","v":""},"","","","","",null,null,null,null,null,null,null,null,null,null,null,"","","","","","","","","",null,null,null,null,null,null,null,null,null,null,null,null,null,null,null,null,null,null,null,null,null,null,null,null,null,null,null,null,null,null,null,null,null,null,null,null,null,null,null,null,null,null,null,null,null,null,null,null,null,null,null,null,null,null,null,null,null,null,null,null,null,null,null,null,null,null,null,null,null,null,null,null,null,null,null,null,null,null,null,null,null,null,null,null,"","","","","",{"$f":"IF(ER87=\"\",\"\",LN(_xlfn.NUMBERVALUE(Visualization!$L$20)))","v":""},{"$f":"IF(ER87=\"\",\"\",LN(_xlfn.NUMBERVALUE(Visualization!$L$21)))","v":""},"",{"$f":"IF(EU87=\"\",\"\",IF(Visualization!$F$21=\"\",0,LN(_xlfn.NUMBERVALUE(Visualization!$F$21))))","v":""},null,"",{"$f":"IF(EN33=\"\",\"\",IF(EY31>99.98,\"\",NORMDIST(EN32,Visualization!$F$51,Visualization!$F$53,1)*100))","v":""}]
[null,null,null,null,null,null,null,null,{"$f":"IF(Values!$D$46=\"\",\"\",34)","v":""},"",{"$f":"IF(J88=\"\",\"\",NORMDIST(J88,Visualization!$F$51,Visualization!$F$53,TRUE))","v":""},{"$f":"IF(J88=\"\",\"\",IF(I88>COUNT(Values!$D$13:$D$62),0,LN(K88)))","v":""},"","","","","",null,null,"","","","","","","","","",null,null,{"$f":"IF(Values!$D$46=\"\",\"\",34)","v":""},"","",{"$f":"IF(AF88=\"\",\"\",IF(AE88>COUNT(Values!$D$13:$D$62),0,LN(AG88)))","v":""},"","","","","",null,null,null,null,null,null,null,null,null,null,null,"","","","","","","","","",null,null,null,null,null,null,null,null,null,null,null,null,null,null,null,null,null,null,null,null,null,null,null,null,null,null,null,null,null,null,null,null,null,null,null,null,null,null,null,null,null,null,null,null,null,null,null,null,null,null,null,null,null,null,null,null,null,null,null,null,null,null,null,null,null,null,null,null,null,null,null,null,null,null,null,null,null,null,null,null,null,null,null,null,"","","","","",{"$f":"IF(ER88=\"\",\"\",LN(_xlfn.NUMBERVALUE(Visualization!$L$20)))","v":""},{"$f":"IF(ER88=\"\",\"\",LN(_xlfn.NUMBERVALUE(Visualization!$L$21)))","v":""},"",{"$f":"IF(EU88=\"\",\"\",IF(Visualization!$F$21=\"\",0,LN(_xlfn.NUMBERVALUE(Visualization!$F$21))))","v":""},null,"",{"$f":"IF(EN34=\"\",\"\",IF(EY32>99.98,\"\",NORMDIST(EN33,Visualization!$F$51,Visualization!$F$53,1)*100))","v":""}]
[null,null,null,null,null,null,null,null,{"$f":"IF(Values!$D$47=\"\",\"\",35)","v":""},"",{"$f":"IF(J89=\"\",\"\",NORMDIST(J89,Visualization!$F$51,Visualization!$F$53,TRUE))","v":""},{"$f":"IF(J89=\"\",\"\",IF(I89>COUNT(Values!$D$13:$D$62),0,LN(K89)))","v":""},"","","","","",null,null,"","","","","","","","","",null,null,{"$f":"IF(Values!$D$47=\"\",\"\",35)","v":""},"","",{"$f":"IF(AF89=\"\",\"\",IF(AE89>COUNT(Values!$D$13:$D$62),0,LN(AG89)))","v":""},"","","","","",null,null,null,null,null,null,null,null,null,null,null,"","","","","","","","","",null,null,null,null,null,null,null,null,null,null,null,null,null,null,null,null,null,null,null,null,null,null,null,null,null,null,null,null,null,null,null,null,null,null,null,null,null,null,null,null,null,null,null,null,null,null,null,null,null,null,null,null,null,null,null,null,null,null,null,null,null,null,null,null,null,null,null,null,null,null,null,null,null,null,null,null,null,null,null,null,null,null,null,null,"","","","","",{"$f":"IF(ER89=\"\",\"\",LN(_xlfn.NUMBERVALUE(Visualization!$L$20)))","v":""},{"$f":"IF(ER89=\"\",\"\",LN(_xlfn.NUMBERVALUE(Visualization!$L$21)))","v":""},"",{"$f":"IF(EU89=\"\",\"\",IF(Visualization!$F$21=\"\",0,LN(_xlfn.NUMBERVALUE(Visualization!$F$21))))","v":""},null,"",{"$f":"IF(EN35=\"\",\"\",IF(EY33>99.98,\"\",NORMDIST(EN34,Visualization!$F$51,Visualization!$F$53,1)*100))","v":""}]
[null,null,null,null,null,null,null,null,{"$f":"IF(Values!$D$48=\"\",\"\",36)","v":""},"",{"$f":"IF(J90=\"\",\"\",NORMDIST(J90,Visualization!$F$51,Visualization!$F$53,TRUE))","v":""},{"$f":"IF(J90=\"\",\"\",IF(I90>COUNT(Values!$D$13:$D$62),0,LN(K90)))","v":""},"","","","","",null,null,"","","","","","","","","",null,null,{"$f":"IF(Values!$D$48=\"\",\"\",36)","v":""},"","",{"$f":"IF(AF90=\"\",\"\",IF(AE90>COUNT(Values!$D$13:$D$62),0,LN(AG90)))","v":""},"","","","","",null,null,null,null,null,null,null,null,null,null,null,"","","","","","","","","",null,null,null,null,null,null,null,null,null,null,null,null,null,null,null,null,null,null,null,null,null,null,null,null,null,null,null,null,null,null,null,null,null,null,null,null,null,null,null,null,null,null,null,null,null,null,null,null,null,null,null,null,null,null,null,null,null,null,null,null,null,null,null,null,null,null,null,null,null,null,null,null,null,null,null,null,null,null,null,null,null,null,null,null,"","","","","",{"$f":"IF(ER90=\"\",\"\",LN(_xlfn.NUMBERVALUE(Visualization!$L$20)))","v":""},{"$f":"IF(ER90=\"\",\"\",LN(_xlfn.NUMBERVALUE(Visualization!$L$21)))","v":""},"",{"$f":"IF(EU90=\"\",\"\",IF(Visualization!$F$21=\"\",0,LN(_xlfn.NUMBERVALUE(Visualization!$F$21))))","v":""},null,"",{"$f":"IF(EN36=\"\",\"\",IF(EY34>99.98,\"\",NORMDIST(EN35,Visualization!$F$51,Visualization!$F$53,1)*100))","v":""}]
[null,null,null,null,null,null,null,null,{"$f":"IF(Values!$D$49=\"\",\"\",37)","v":""},"",{"$f":"IF(J91=\"\",\"\",NORMDIST(J91,Visualization!$F$51,Visualization!$F$53,TRUE))","v":""},{"$f":"IF(J91=\"\",\"\",IF(I91>COUNT(Values!$D$13:$D$62),0,LN(K91)))","v":""},"","","","","",null,null,"","","","","","","","","",null,null,{"$f":"IF(Values!$D$49=\"\",\"\",37)","v":""},"","",{"$f":"IF(AF91=\"\",\"\",IF(AE91>COUNT(Values!$D$13:$D$62),0,LN(AG91)))","v":""},"","","","","",null,null,null,null,null,null,null,null,null,null,null,"","","","","","","","","",null,null,null,null,null,null,null,null,null,null,null,null,null,null,null,null,null,null,null,null,null,null,null,null,null,null,null,null,null,null,null,null,null,null,null,null,null,null,null,null,null,null,null,null,null,null,null,null,null,null,null,null,null,null,null,null,null,null,null,null,null,null,null,null,null,null,null,null,null,null,null,null,null,null,null,null,null,null,null,null,null,null,null,null,"","","","","",{"$f":"IF(ER91=\"\",\"\",LN(_xlfn.NUMBERVALUE(Visualization!$L$20)))","v":""},{"$f":"IF(ER91=\"\",\"\",LN(_xlfn.NUMBERVALUE(Visualization!$L$21)))","v":""},"",{"$f":"IF(EU91=\"\",\"\",IF(Visualization!$F$21=\"\",0,LN(_xlfn.NUMBERVALUE(Visualization!$F$21))))","v":""},null,"",{"$f":"IF(EN37=\"\",\"\",IF(EY35>99.98,\"\",NORMDIST(EN36,Visualization!$F$51,Visualization!$F$53,1)*100))","v":""}]
[null,null,null,null,null,null,null,null,{"$f":"IF(Values!$D$50=\"\",\"\",38)","v":""},"",{"$f":"IF(J92=\"\",\"\",NORMDIST(J92,Visualization!$F$51,Visualization!$F$53,TRUE))","v":""},{"$f":"IF(J92=\"\",\"\",IF(I92>COUNT(Values!$D$13:$D$62),0,LN(K92)))","v":""},"","","","","",null,null,"","","","","","","","","",null,null,{"$f":"IF(Values!$D$50=\"\",\"\",38)","v":""},"","",{"$f":"IF(AF92=\"\",\"\",IF(AE92>COUNT(Values!$D$13:$D$62),0,LN(AG92)))","v":""},"","","","","",null,null,null,null,null,null,null,null,null,null,null,"","","","","","","","","",null,null,null,null,null,null,null,null,null,null,null,null,null,null,null,null,null,null,null,null,null,null,null,null,null,null,null,null,null,null,null,null,null,null,null,null,null,null,null,null,null,null,null,null,null,null,null,null,null,null,null,null,null,null,null,null,null,null,null,null,null,null,null,null,null,null,null,null,null,null,null,null,null,null,null,null,null,null,null,null,null,null,null,null,"","","","","",{"$f":"IF(ER92=\"\",\"\",LN(_xlfn.NUMBERVALUE(Visualization!$L$20)))","v":""},{"$f":"IF(ER92=\"\",\"\",LN(_xlfn.NUMBERVALUE(Visualization!$L$21)))","v":""},"",{"$f":"IF(EU92=\"\",\"\",IF(Visualization!$F$21=\"\",0,LN(_xlfn.NUMBERVALUE(Visualization!$F$21))))","v":""},null,"",{"$f":"IF(EN38=\"\",\"\",IF(EY36>99.98,\"\",NORMDIST(EN37,Visualization!$F$51,Visualization!$F$53,1)*100))","v":""}]
[null,null,null,null,null,null,null,null,{"$f":"IF(Values!$D$51=\"\",\"\",39)","v":""},"",{"$f":"IF(J93=\"\",\"\",NORMDIST(J93,Visualization!$F$51,Visualization!$F$53,TRUE))","v":""},{"$f":"IF(J93=\"\",\"\",IF(I93>COUNT(Values!$D$13:$D$62),0,LN(K93)))","v":""},"","","","","",null,null,"","","","","","","","","",null,null,{"$f":"IF(Values!$D$51=\"\",\"\",39)","v":""},"","",{"$f":"IF(AF93=\"\",\"\",IF(AE93>COUNT(Values!$D$13:$D$62),0,LN(AG93)))","v":""},"","","","","",null,null,null,null,null,null,null,null,null,null,null,"","","","","","","","","",null,null,null,null,null,null,null,null,null,null,null,null,null,null,null,null,null,null,null,null,null,null,null,null,null,null,null,null,null,null,null,null,null,null,null,null,null,null,null,null,null,null,null,null,null,null,null,null,null,null,null,null,null,null,null,null,null,null,null,null,null,null,null,null,null,null,null,null,null,null,null,null,null,null,null,null,null,null,null,null,null,null,null,null,"","","","","",{"$f":"IF(ER93=\"\",\"\",LN(_xlfn.NUMBERVALUE(Visualization!$L$20)))","v":""},{"$f":"IF(ER93=\"\",\"\",LN(_xlfn.NUMBERVALUE(Visualization!$L$21)))","v":""},"",{"$f":"IF(EU93=\"\",\"\",IF(Visualization!$F$21=\"\",0,LN(_xlfn.NUMBERVALUE(Visualization!$F$21))))","v":""},null,"",{"$f":"IF(EN39=\"\",\"\",IF(EY37>99.98,\"\",NORMDIST(EN38,Visualization!$F$51,Visualization!$F$53,1)*100))","v":""}]
[null,null,null,null,null,null,null,null,{"$f":"IF(Values!$D$52=\"\",\"\",40)","v":""},"",{"$f":"IF(J94=\"\",\"\",NORMDIST(J94,Visualization!$F$51,Visualization!$F$53,TRUE))","v":""},{"$f":"IF(J94=\"\",\"\",IF(I94>COUNT(Values!$D$13:$D$62),0,LN(K94)))","v":""},"","","","","",null,null,"","","","","","","","","",null,null,{"$f":"IF(Values!$D$52=\"\",\"\",40)","v":""},"","",{"$f":"IF(AF94=\"\",\"\",IF(AE94>COUNT(Values!$D$13:$D$62),0,LN(AG94)))","v":""},"","","","","",null,null,null,null,null,null,null,null,null,null,null,"","","","","","","","","",null,null,null,null,null,null,null,null,null,null,null,null,null,null,null,null,null,null,null,null,null,null,null,null,null,null,null,null,null,null,null,null,null,null,null,null,null,null,null,null,null,null,null,null,null,null,null,null,null,null,null,null,null,null,null,null,null,null,null,null,null,null,null,null,null,null,null,null,null,null,null,null,null,null,null,null,null,null,null,null,null,null,null,null,"","","","","",{"$f":"IF(ER94=\"\",\"\",LN(_xlfn.NUMBERVALUE(Visualization!$L$20)))","v":""},{"$f":"IF(ER94=\"\",\"\",LN(_xlfn.NUMBERVALUE(Visualization!$L$21)))","v":""},"",{"$f":"IF(EU94=\"\",\"\",IF(Visualization!$F$21=\"\",0,LN(_xlfn.NUMBERVALUE(Visualization!$F$21))))","v":""},null,"",{"$f":"IF(EN40=\"\",\"\",IF(EY38>99.98,\"\",NORMDIST(EN39,Visualization!$F$51,Visualization!$F$53,1)*100))","v":""}]
[null,null,null,null,null,null,null,null,{"$f":"IF(Values!$D$53=\"\",\"\",41)","v":""},"",{"$f":"IF(J95=\"\",\"\",NORMDIST(J95,Visualization!$F$51,Visualization!$F$53,TRUE))","v":""},{"$f":"IF(J95=\"\",\"\",IF(I95>COUNT(Values!$D$13:$D$62),0,LN(K95)))","v":""},"","","","","",null,null,"","","","","","","","","",null,null,{"$f":"IF(Values!$D$53=\"\",\"\",41)","v":""},"","",{"$f":"IF(AF95=\"\",\"\",IF(AE95>COUNT(Values!$D$13:$D$62),0,LN(AG95)))","v":""},"","","","","",null,null,null,null,null,null,null,null,null,null,null,"","","","","","","","","",null,null,null,null,null,null,null,null,null,null,null,null,null,null,null,null,null,null,null,null,null,null,null,null,null,null,null,null,null,null,null,null,null,null,null,null,null,null,null,null,null,null,null,null,null,null,null,null,null,null,null,null,null,null,null,null,null,null,null,null,null,null,null,null,null,null,null,null,null,null,null,null,null,null,null,null,null,null,null,null,null,null,null,null,"","","","","",{"$f":"IF(ER95=\"\",\"\",LN(_xlfn.NUMBERVALUE(Visualization!$L$20)))","v":""},{"$f":"IF(ER95=\"\",\"\",LN(_xlfn.NUMBERVALUE(Visualization!$L$21)))","v":""},"",{"$f":"IF(EU95=\"\",\"\",IF(Visualization!$F$21=\"\",0,LN(_xlfn.NUMBERVALUE(Visualization!$F$21))))","v":""},null,"",{"$f":"IF(EN41=\"\",\"\",IF(EY39>99.98,\"\",NORMDIST(EN40,Visualization!$F$51,Visualization!$F$53,1)*100))","v":""}]
[null,null,null,null,null,null,null,null,{"$f":"IF(Values!$D$54=\"\",\"\",42)","v":""},"",{"$f":"IF(J96=\"\",\"\",NORMDIST(J96,Visualization!$F$51,Visualization!$F$53,TRUE))","v":""},{"$f":"IF(J96=\"\",\"\",IF(I96>COUNT(Values!$D$13:$D$62),0,LN(K96)))","v":""},"","","","","",null,null,"","","","","","","","","",null,null,{"$f":"IF(Values!$D$54=\"\",\"\",42)","v":""},"","",{"$f":"IF(AF96=\"\",\"\",IF(AE96>COUNT(Values!$D$13:$D$62),0,LN(AG96)))","v":""},"","","","","",null,null,null,null,null,null,null,null,null,null,null,"",{"$f":"IF(AY96=\"\",\"\",SMALL($DA$8:$DA$57,AY96))","v":""},{"$f":"IF(AY96<>\"\",1-EXP(-1*((AZ96)/($CR$45))^$CR$44),\"\")","v":""},"",{"$f":"IF(AY96=\"\",\"\",LARGE($DA$8:$DA$57,AY96))","v":""},{"$f":"IF(AY96<>\"\",1-(1-EXP(-1*((BC96)/($CR$45))^$CR$44)),\"\")","v":""},"","",{"$f":"IF(AY96=\"\",\"\",(1-2*AY96)/$DW$8)","v":""},null,null,null,null,null,null,null,null,null,null,null,null,null,null,null,null,null,null,null,null,null,null,null,null,null,null,null,null,null,null,null,null,null,null,null,null,null,null,null,null,null,null,null,null,null,null,null,null,null,null,null,null,null,null,null,null,null,null,null,null,null,null,null,null,null,null,null,null,null,null,null,null,null,null,null,null,null,null,null,null,null,null,null,null,"","","","","",{"$f":"IF(ER96=\"\",\"\",LN(_xlfn.NUMBERVALUE(Visualization!$L$20)))","v":""},{"$f":"IF(ER96=\"\",\"\",LN(_xlfn.NUMBERVALUE(Visualization!$L$21)))","v":""},"",{"$f":"IF(EU96=\"\",\"\",IF(Visualization!$F$21=\"\",0,LN(_xlfn.NUMBERVALUE(Visualization!$F$21))))","v":""},null,"",{"$f":"IF(EN42=\"\",\"\",IF(EY40>99.98,\"\",NORMDIST(EN41,Visualization!$F$51,Visualization!$F$53,1)*100))","v":""}]
[null,null,null,null,null,null,null,null,{"$f":"IF(Values!$D$55=\"\",\"\",43)","v":""},"",{"$f":"IF(J97=\"\",\"\",NORMDIST(J97,Visualization!$F$51,Visualization!$F$53,TRUE))","v":""},{"$f":"IF(J97=\"\",\"\",IF(I97>COUNT(Values!$D$13:$D$62),0,LN(K97)))","v":""},"","","","","",null,null,"","","","","","","","","",null,null,{"$f":"IF(Values!$D$55=\"\",\"\",43)","v":""},"","",{"$f":"IF(AF97=\"\",\"\",IF(AE97>COUNT(Values!$D$13:$D$62),0,LN(AG97)))","v":""},"","","","","",null,null,null,null,null,null,null,null,null,null,null,"","","","","","","","","",null,null,null,null,null,null,null,null,null,null,null,null,null,null,null,null,null,null,null,null,null,null,null,null,null,null,null,null,null,null,null,null,null,null,null,null,null,null,null,null,null,null,null,null,null,null,null,null,null,null,null,null,null,null,null,null,null,null,null,null,null,null,null,null,null,null,null,null,null,null,null,null,null,null,null,null,null,null,null,null,null,null,null,null,"","","","","",{"$f":"IF(ER97=\"\",\"\",LN(_xlfn.NUMBERVALUE(Visualization!$L$20)))","v":""},{"$f":"IF(ER97=\"\",\"\",LN(_xlfn.NUMBERVALUE(Visualization!$L$21)))","v":""},"",{"$f":"IF(EU97=\"\",\"\",IF(Visualization!$F$21=\"\",0,LN(_xlfn.NUMBERVALUE(Visualization!$F$21))))","v":""},null,"",{"$f":"IF(EN43=\"\",\"\",IF(EY41>99.98,\"\",NORMDIST(EN42,Visualization!$F$51,Visualization!$F$53,1)*100))","v":""}]
[null,null,null,null,null,null,null,null,{"$f":"IF(Values!$D$56=\"\",\"\",44)","v":""},"",{"$f":"IF(J98=\"\",\"\",NORMDIST(J98,Visualization!$F$51,Visualization!$F$53,TRUE))","v":""},{"$f":"IF(J98=\"\",\"\",IF(I98>COUNT(Values!$D$13:$D$62),0,LN(K98)))","v":""},"","","","","",null,null,"","","","","","","","","",null,null,{"$f":"IF(Values!$D$56=\"\",\"\",44)","v":""},"","",{"$f":"IF(AF98=\"\",\"\",IF(AE98>COUNT(Values!$D$13:$D$62),0,LN(AG98)))","v":""},"","","","","",null,null,null,null,null,null,null,null,null,null,null,"","","","","","","","","",null,null,null,null,null,null,null,null,null,null,null,null,null,null,null,null,null,null,null,null,null,null,null,null,null,null,null,null,null,null,null,null,null,null,null,null,null,null,null,null,null,null,null,null,null,null,null,null,null,null,null,null,null,null,null,null,null,null,null,null,null,null,null,null,null,null,null,null,null,null,null,null,null,null,null,null,null,null,null,null,null,null,null,null,"","","","","",{"$f":"IF(ER98=\"\",\"\",LN(_xlfn.NUMBERVALUE(Visualization!$L$20)))","v":""},{"$f":"IF(ER98=\"\",\"\",LN(_xlfn.NUMBERVALUE(Visualization!$L$21)))","v":""},"",{"$f":"IF(EU98=\"\",\"\",IF(Visualization!$F$21=\"\",0,LN(_xlfn.NUMBERVALUE(Visualization!$F$21))))","v":""},null,"",{"$f":"IF(EN44=\"\",\"\",IF(EY42>99.98,\"\",NORMDIST(EN43,Visualization!$F$51,Visualization!$F$53,1)*100))","v":""}]
[null,null,null,null,null,null,null,null,{"$f":"IF(Values!$D$57=\"\",\"\",45)","v":""},"",{"$f":"IF(J99=\"\",\"\",NORMDIST(J99,Visualization!$F$51,Visualization!$F$53,TRUE))","v":""},{"$f":"IF(J99=\"\",\"\",IF(I99>COUNT(Values!$D$13:$D$62),0,LN(K99)))","v":""},"","","","","",null,null,"",{"$f":"IF(T99=\"\",\"\",SMALL($DA$8:$DA$57,T99))","v":""},{"$f":"IF(T99<>\"\",1-EXP(-1*((U99)/($CR$45))^2),\"\")","v":""},"",{"$f":"IF(T99=\"\",\"\",LARGE($DA$8:$DA$57,T99))","v":""},{"$f":"IF(T99<>\"\",1-(1-EXP(-1*((X99)/($CR$45))^2)),\"\")","v":""},"","",{"$f":"IF(T99=\"\",\"\",(1-2*T99)/$DW$8)","v":""},null,null,{"$f":"IF(Values!$D$57=\"\",\"\",45)","v":""},"","",{"$f":"IF(AF99=\"\",\"\",IF(AE99>COUNT(Values!$D$13:$D$62),0,LN(AG99)))","v":""},"","","","","",null,null,null,null,null,null,null,null,null,null,null,"","","","","","","","","",null,null,null,null,null,null,null,null,null,null,null,null,null,null,null,null,null,null,null,null,null,null,null,null,null,null,null,null,null,null,null,null,null,null,null,null,null,null,null,null,null,null,null,null,null,null,null,null,null,null,null,null,null,null,null,null,null,null,null,null,null,null,null,null,null,null,null,null,null,null,null,null,null,null,null,null,null,null,null,null,null,null,null,null,"","","","","",{"$f":"IF(ER99=\"\",\"\",LN(_xlfn.NUMBERVALUE(Visualization!$L$20)))","v":""},{"$f":"IF(ER99=\"\",\"\",LN(_xlfn.NUMBERVALUE(Visualization!$L$21)))","v":""},"",{"$f":"IF(EU99=\"\",\"\",IF(Visualization!$F$21=\"\",0,LN(_xlfn.NUMBERVALUE(Visualization!$F$21))))","v":""},null,"",{"$f":"IF(EN45=\"\",\"\",IF(EY43>99.98,\"\",NORMDIST(EN44,Visualization!$F$51,Visualization!$F$53,1)*100))","v":""}]
[null,null,null,null,null,null,null,null,{"$f":"IF(Values!$D$58=\"\",\"\",46)","v":""},"",{"$f":"IF(J100=\"\",\"\",NORMDIST(J100,Visualization!$F$51,Visualization!$F$53,TRUE))","v":""},{"$f":"IF(J100=\"\",\"\",IF(I100>COUNT(Values!$D$13:$D$62),0,LN(K100)))","v":""},"","","","","",null,null,"","","","","","","","","",null,null,{"$f":"IF(Values!$D$58=\"\",\"\",46)","v":""},"","",{"$f":"IF(AF100=\"\",\"\",IF(AE100>COUNT(Values!$D$13:$D$62),0,LN(AG100)))","v":""},"","","","","",null,null,null,null,null,null,null,null,null,null,null,"","","","","","","","","",null,null,null,null,null,null,null,null,null,null,null,null,null,null,null,null,null,null,null,null,null,null,null,null,null,null,null,null,null,null,null,null,null,null,null,null,null,null,null,null,null,null,null,null,null,null,null,null,null,null,null,null,null,null,null,null,null,null,null,null,null,null,null,null,null,null,null,null,null,null,null,null,null,null,null,null,null,null,null,null,null,null,null,null,"","","","","",{"$f":"IF(ER100=\"\",\"\",LN(_xlfn.NUMBERVALUE(Visualization!$L$20)))","v":""},{"$f":"IF(ER100=\"\",\"\",LN(_xlfn.NUMBERVALUE(Visualization!$L$21)))","v":""},"",{"$f":"IF(EU100=\"\",\"\",IF(Visualization!$F$21=\"\",0,LN(_xlfn.NUMBERVALUE(Visualization!$F$21))))","v":""},null,"",{"$f":"IF(EN46=\"\",\"\",IF(EY44>99.98,\"\",NORMDIST(EN45,Visualization!$F$51,Visualization!$F$53,1)*100))","v":""}]
[null,null,null,null,null,null,null,null,{"$f":"IF(Values!$D$59=\"\",\"\",47)","v":""},"",{"$f":"IF(J101=\"\",\"\",NORMDIST(J101,Visualization!$F$51,Visualization!$F$53,TRUE))","v":""},{"$f":"IF(J101=\"\",\"\",IF(I101>COUNT(Values!$D$13:$D$62),0,LN(K101)))","v":""},"","","","","",null,null,"","","","","","","","","",null,null,{"$f":"IF(Values!$D$59=\"\",\"\",47)","v":""},"","",{"$f":"IF(AF101=\"\",\"\",IF(AE101>COUNT(Values!$D$13:$D$62),0,LN(AG101)))","v":""},"","","","","",null,null,null,null,null,null,null,null,null,null,null,"","","","","","","","","",null,null,null,null,null,null,null,null,null,null,null,null,null,null,null,null,null,null,null,null,null,null,null,null,null,null,null,null,null,null,null,null,null,null,null,null,null,null,null,null,null,null,null,null,null,null,null,null,null,null,null,null,null,null,null,null,null,null,null,null,null,null,null,null,null,null,null,null,null,null,null,null,null,null,null,null,null,null,null,null,null,null,null,null,"","","","","",{"$f":"IF(ER101=\"\",\"\",LN(_xlfn.NUMBERVALUE(Visualization!$L$20)))","v":""},{"$f":"IF(ER101=\"\",\"\",LN(_xlfn.NUMBERVALUE(Visualization!$L$21)))","v":""},"",{"$f":"IF(EU101=\"\",\"\",IF(Visualization!$F$21=\"\",0,LN(_xlfn.NUMBERVALUE(Visualization!$F$21))))","v":""},null,"",{"$f":"IF(EN47=\"\",\"\",IF(EY45>99.98,\"\",NORMDIST(EN46,Visualization!$F$51,Visualization!$F$53,1)*100))","v":""}]
[null,null,null,null,null,null,null,null,{"$f":"IF(Values!$D$60=\"\",\"\",48)","v":""},"",{"$f":"IF(J102=\"\",\"\",NORMDIST(J102,Visualization!$F$51,Visualization!$F$53,TRUE))","v":""},{"$f":"IF(J102=\"\",\"\",IF(I102>COUNT(Values!$D$13:$D$62),0,LN(K102)))","v":""},"","","","","",null,null,"","","","","","","","","",null,null,{"$f":"IF(Values!$D$60=\"\",\"\",48)","v":""},"","",{"$f":"IF(AF102=\"\",\"\",IF(AE102>COUNT(Values!$D$13:$D$62),0,LN(AG102)))","v":""},"","","","","",null,null,null,null,null,null,null,null,null,null,null,"","","","","","","","","",null,null,null,null,null,null,null,null,null,null,null,null,null,null,null,null,null,null,null,null,null,null,null,null,null,null,null,null,null,null,null,null,null,null,null,null,null,null,null,null,null,null,null,null,null,null,null,null,null,null,null,null,null,null,null,null,null,null,null,null,null,null,null,null,null,null,null,null,null,null,null,null,null,null,null,null,null,null,null,null,null,null,null,null,"","","","","",{"$f":"IF(ER102=\"\",\"\",LN(_xlfn.NUMBERVALUE(Visualization!$L$20)))","v":""},{"$f":"IF(ER102=\"\",\"\",LN(_xlfn.NUMBERVALUE(Visualization!$L$21)))","v":""},"",{"$f":"IF(EU102=\"\",\"\",IF(Visualization!$F$21=\"\",0,LN(_xlfn.NUMBERVALUE(Visualization!$F$21))))","v":""},null,"",{"$f":"IF(EN48=\"\",\"\",IF(EY46>99.98,\"\",NORMDIST(EN47,Visualization!$F$51,Visualization!$F$53,1)*100))","v":""}]
[null,null,null,null,null,null,null,null,{"$f":"IF(Values!$D$61=\"\",\"\",49)","v":""},"",{"$f":"IF(J103=\"\",\"\",NORMDIST(J103,Visualization!$F$51,Visualization!$F$53,TRUE))","v":""},{"$f":"IF(J103=\"\",\"\",IF(I103>COUNT(Values!$D$13:$D$62),0,LN(K103)))","v":""},"","","","","",null,null,"","","","","","","","","",null,null,{"$f":"IF(Values!$D$61=\"\",\"\",49)","v":""},"","",{"$f":"IF(AF103=\"\",\"\",IF(AE103>COUNT(Values!$D$13:$D$62),0,LN(AG103)))","v":""},"","","","","",null,null,null,null,null,null,null,null,null,null,null,"","","","","","","","","",null,null,null,null,null,null,null,null,null,null,null,null,null,null,null,null,null,null,null,null,null,null,null,null,null,null,null,null,null,null,null,null,null,null,null,null,null,null,null,null,null,null,null,null,null,null,null,null,null,null,null,null,null,null,null,null,null,null,null,null,null,null,null,null,null,null,null,null,null,null,null,null,null,null,null,null,null,null,null,null,null,null,null,null,"","","","","",{"$f":"IF(ER103=\"\",\"\",LN(_xlfn.NUMBERVALUE(Visualization!$L$20)))","v":""},{"$f":"IF(ER103=\"\",\"\",LN(_xlfn.NUMBERVALUE(Visualization!$L$21)))","v":""},"",{"$f":"IF(EU103=\"\",\"\",IF(Visualization!$F$21=\"\",0,LN(_xlfn.NUMBERVALUE(Visualization!$F$21))))","v":""},null,"",{"$f":"IF(EN49=\"\",\"\",IF(EY47>99.98,\"\",NORMDIST(EN48,Visualization!$F$51,Visualization!$F$53,1)*100))","v":""}]
[null,null,null,null,null,null,null,null,{"$f":"IF(Values!$D$62=\"\",\"\",50)","v":""},"",{"$f":"IF(J104=\"\",\"\",NORMDIST(J104,Visualization!$F$51,Visualization!$F$53,TRUE))","v":""},{"$f":"IF(J104=\"\",\"\",IF(I104>COUNT(Values!$D$13:$D$62),0,LN(K104)))","v":""},"","","","","",null,null,"","","","","","","","","",null,null,{"$f":"IF(Values!$D$62=\"\",\"\",50)","v":""},"","",{"$f":"IF(AF104=\"\",\"\",IF(AE104>COUNT(Values!$D$13:$D$62),0,LN(AG104)))","v":""},"","","","","",null,null,null,null,null,null,null,null,null,null,null,"","","","","","","","","",null,null,null,null,null,null,null,null,null,null,null,null,null,null,null,null,null,null,null,null,null,null,null,null,null,null,null,null,null,null,null,null,null,null,null,null,null,null,null,null,null,null,null,null,null,null,null,null,null,null,null,null,null,null,null,null,null,null,null,null,null,null,null,null,null,null,null,null,null,null,null,null,null,null,null,null,null,null,null,null,null,null,null,null,"","","","","",{"$f":"IF(ER104=\"\",\"\",LN(_xlfn.NUMBERVALUE(Visualization!$L$20)))","v":""},{"$f":"IF(ER104=\"\",\"\",LN(_xlfn.NUMBERVALUE(Visualization!$L$21)))","v":""},"",{"$f":"IF(EU104=\"\",\"\",IF(Visualization!$F$21=\"\",0,LN(_xlfn.NUMBERVALUE(Visualization!$F$21))))","v":""},null,"",{"$f":"IF(EN50=\"\",\"\",IF(EY48>99.98,\"\",NORMDIST(EN49,Visualization!$F$51,Visualization!$F$53,1)*100))","v":""}]
[null,null,null,null,null,null,null,null,null,null,null,null,null,null,null,null,null,null,null,"","","","","","","","","",null,null,null,null,null,null,null,null,null,null,null,null,null,null,null,null,null,null,null,null,null,null,"","","","","","","","",""]
[null,null,null,null,null,null,null,null,null,null,null,null,null,null,null,null,null,null,null,"","","","","","","","","",null,null,null,null,null,null,null,null,null,null,null,null,null,null,null,null,null,null,null,null,null,null,"","","","","","","","",""]
[null,null,null,null,null,null,null,null,null,null,null,null,null,null,null,null,null,null,null,"","","","","","","","","",null,null,null,null,null,null,null,null,null,null,null,null,null,null,null,null,null,null,null,null,null,null,"","","","","","","","","",null,null,null,null,null,null,null,null,null,null,null,null,null,null,null,null,null,null,null,null,null,null,null,null,null,null,null,null,null,null,null,null,null,null,null,null,null,null,null,null,null,null,null,null,null,null,null,null,null,null,null,null,null,null,null,null,null,null,null,null,null,null,null,null,null,null,null,null,null,null,null,null,null,null,null,null,null,null,null,null,null,null,null,null,null,null,null,null,null,null,null,null,null,"Max",{"$f":"_xlfn.AGGREGATE(4,6,EX62:EY104)","v":0}]
[null,null,null,null,null,null,null,null,"Test value AD: ",null,null,"AD*",{"$f":"IF(I109=\"\",\"\",I109*(1+0.75/COUNT(J55:J104)+2.25/COUNT(J55:J104)^2))","v":""},null,"H1 = True If AD > SW",null,null,null,null,"","","","","","","","","",null,null,"Test value AD: ",null,null,"AD*",{"$f":"IF(AE109=\"\",\"\",AE109*(1+0.75/COUNT(AF55:AF104)+2.25/COUNT(AF55:AF104)^2))","v":""},null,"H1 = True If AD > SW",null,null,null,null,null,null,null,null,null,null,null,null,null,"","","","","","","","",""]
[null,null,null,null,null,null,null,null,{"$f":"IF(J55=\"\",\"\",SUMPRODUCT(P55:P104,Q55:Q104)-COUNT(J55:J104))","v":""},null,null,"p1",{"$f":"IF(M108=\"\",\"\",IF(AND(M108<13,M108>=0.6),EXP(1.2937-5.709*M108+0.0186*M108^2),0))","v":""},null,"H0 = True If AD < SW",null,null,null,null,"","","","","","","","","",null,null,{"$f":"IF(AF55=\"\",\"\",SUMPRODUCT(AL55:AL104,AM55:AM104)-COUNT(AF55:AF104))","v":""},null,null,"p1",{"$f":"IF(AI108=\"\",\"\",IF(AND(AI108<13,AI108>=0.6),EXP(1.2937-5.709*AI108+0.0186*AI108^2),0))","v":""},null,"H0 = True If AD < SW",null,null,null,null,null,null,null,null,null,null,null,null,null,"","","","","","","","",""]
[null,null,null,null,null,null,null,null,null,null,null,"p2",{"$f":"IF(M108=\"\",\"\",IF(AND(M108<0.6,M108>=0.34),EXP(0.9177-4.279*M108-1.38*M108^2),0))","v":""},null,null,null,null,null,null,"","","","","","","","","",null,null,null,null,null,"p2",{"$f":"IF(AI108=\"\",\"\",IF(AND(AI108<0.6,AI108>=0.34),EXP(0.9177-4.279*AI108-1.38*AI108^2),0))","v":""},null,null,null,null,null,null,null,null,null,null,null,null,null,null,null,"","","","","","","","",""]
[null,null,null,null,null,null,null,null,null,null,null,"p3",{"$f":"IF(M108=\"\",\"\",IF(AND(M108<0.34,M108>=0.2),1-EXP(-8.318+42.796*M108-59.938*M108^2),0))","v":""},null,"H1: Values are normal ditributed",null,null,null,null,"","","","","","","","","",null,null,null,null,null,"p3",{"$f":"IF(AI108=\"\",\"\",IF(AND(AI108<0.34,AI108>=0.2),1-EXP(-8.318+42.796*AI108-59.938*AI108^2),0))","v":""},null,"H1: Values are normal ditributed",null,null,null,null,null,null,null,null,null,null,null,null,null,"","","","","","","","",""]
[null,null,null,null,null,null,null,null,null,null,null,"p4",{"$f":"IF(M108=\"\",\"\",IF(M108<0.2,1-EXP(-13.436+101.14*M108-223.73*M108^2),0))","v":""},null,"H0: Values are not normal distributed",null,null,null,null,"","","","","","","","","",null,null,null,null,null,"p4",{"$f":"IF(AI108=\"\",\"\",IF(AI108<0.2,1-EXP(-13.436+101.14*AI108-223.73*AI108^2),0))","v":""},null,"H0: Values are not normal distributed",null,null,null,null,null,null,null,null,null,null,null,null,null,"","","","","","","","",""]
[null,null,null,null,null,null,null,null,"Threshold SW [95%]:",null,null,null,null,null,null,null,null,null,null,"","","","","","","","","",null,null,"Threshold SW [95%]:",null,null,null,null,null,null,null,null,null,null,null,null,null,null,null,null,null,null,null,"","","","","","","","",""]
[null,null,null,null,null,null,null,null,0.05,null,null,null,null,null,null,null,null,null,null,"","","","","","","","","",null,null,0.05]
[null,null,null,null,null,null,null,null,null,null,null,"The Anderson Darling test of normalety is a powerful tool for small (6) until big (125) amount of values.\nThe Anderson Darling test evaluate the entire distribution with a focus on the peripheral areas.",null,null,null,null,null,null,null,"","","","","","","","","",null,null,null,null,null,"The Anderson Darling test of normalety is a powerful tool for small (6) until big (125) amount of values.\nThe Anderson Darling test evaluate the entire distribution with a focus on the peripheral areas.",null,null,null,null,null,null,null,null,null,null,null,null,null,null,null,null,null,null,null,null,null,null,null,null,null,null,null,null,null,null,null,null,null,null,null,null,null,null,null,null,null,null,null,null,null,null,null,null,null,null,null,null,null,null,null,null,null,null,null,null,null,null,null,null,null,null,null,null,null,null,null,null,null,null,null,null,null,null,null,null,null,null,null,null,null,null,null,null,null,null,null,null,null,null,null,null,null,null,null,null,null,null,null,null,null,null,null,null,null,"Classes","Values per class",null,"Number of values per class [%]","Number of values per class [%] (accumulated)","USL","LSL","Amount of classes","Set Point",null,null,"Y- Values",null,"Expected",null,"Y- Values",null,"Expected",null,"Y- Values",null,"Expected"]
[null,null,null,null,null,null,null,null,null,null,null,null,null,null,null,null,null,null,null,"","","","","","","","","",null,null,null,null,null,null,null,null,null,null,null,null,null,null,null,null,null,null,null,null,null,null,"Schwellwert SW [95%]:",null,{"$f":"0.757","v":0.75700000000000001},null,null,"Prüfgrösse A*: ",null,{"$f":"(SUMPRODUCT(BF64:BF113,BG64:BG113)-DW8)*(1+1/(5*DW8^0.5))","v":{"$error":"#VALUE!"}}]
[null,null,null,null,null,null,null,null,null,null,null,null,null,null,null,null,null,null,null,null,null,null,null,null,null,null,null,null,null,null,null,null,null,null,null,null,null,null,null,null,null,null,null,null,null,null,null,null,null,null,null,null,null,null,null,null,null,null,null,null,null,null,null,null,null,null,null,null,null,null,null,null,null,null,null,null,null,null,null,null,null,null,null,null,null,null,null,null,null,null,null,null,null,null,null,null,null,null,null,null,null,null,null,null,null,null,null,null,null,null,null,null,null,null,null,null,null,null,null,null,null,null,null,null,null,null,null,null,null,null,null,null,null,null,null,null,null,null,null,null,null,null,null,{"$f":"IF($DW$8<15,\"\",IF(DW10-2*DW13<0,0,DW10-2*DW13))","v":{"$error":"#VALUE!"}},{"$f":"IF(EN117=\"\",\"\",IF(OR(COUNT($DA$8:$DA$57)=EO115,EO115=\"\"),\"\",FREQUENCY($DA$8:$DA$57,EN117)))","v":{"$error":"#VALUE!"}},{"$f":"EO117","v":{"$error":"#VALUE!"}},{"$f":"IF(EP117=\"\",\"\",(100/(SUM($EP$8:$EP$27))*EP117))","v":{"$error":"#VALUE!"}},{"$f":"IF(EP117=\"\",\"\",EQ117)","v":{"$error":"#VALUE!"}},{"$f":"IF(ER117=\"\",\"\",_xlfn.NUMBERVALUE(Visualization!$L$20))","v":{"$error":"#VALUE!"}},{"$f":"IF(ER117=\"\",\"\",_xlfn.NUMBERVALUE(Visualization!$L$21))","v":{"$error":"#VALUE!"}},{"$f":"IF(EO117=\"\",\"\",MAX($EQ$8:$EQ$27))","v":{"$error":"#VALUE!"}},{"$f":"IF(EU117=\"\",\"\",IF(Visualization!$F$21=\"\",0,_xlfn.NUMBERVALUE(Visualization!$F$21)))","v":{"$error":"#VALUE!"}},null,null,{"$f":"IFERROR(_xlfn.WEIBULL.DIST(EN117,$CR$44,$CR$45,FALSE),\"#N/A\")","v":"#N/A"},null,{"$f":"IF(EO117=\"\",\"\",_xlfn.WEIBULL.DIST(EN117,$CR$45,$CR$44,TRUE)*100)","v":{"$error":"#VALUE!"}},null,{"$f":"IFERROR(IF(EN117<=0,#N/A,((EXP(-((((EN117-$EC$28)/$EC$29)^2)/2))+EXP(-((((EN117+$EC$28)/$EC$29)^2)/2)))/($EC$29*SQRT(2*PI())))),0)","v":0},null,{"$f":"IF(ER117=\"\",\"\",(_xlfn.NORM.DIST(EN117,$EC$23,$EC$24,1)-0/(1-0))*100)","v":{"$error":"#VALUE!"}},null,{"$f":"IF(EN117<=0,0,IF(2*(((EN117-$EI$10)/$CR$45)^(2-1)*EXP(-(EN117-$EI$10)/$CR$45)^2/$CR$45)<0,0,2*(((EN117-$EI$10)/$CR$45)^(2-1)*EXP(-(EN117-$EI$10)/$CR$45)^2/$CR$45)))","v":{"$error":"#VALUE!"}},null,{"$f":"IF(ER117=\"\",\"\",_xlfn.WEIBULL.DIST(EN117,2,$CR$44,1)*100)","v":{"$error":"#VALUE!"}}]
[null,null,null,null,null,null,null,null,null,null,null,null,null,null,null,null,null,null,null,null,null,null,null,null,null,null,null,null,null,null,null,null,null,null,null,null,null,null,null,null,null,null,null,null,null,null,null,null,null,null,null,null,null,null,null,null,null,null,null,null,null,null,null,null,null,null,null,null,null,null,null,null,null,null,null,null,null,null,null,null,null,null,null,null,null,null,null,null,null,null,null,null,null,null,null,null,null,null,null,null,null,null,null,null,null,null,null,null,null,null,null,null,null,null,null,null,null,null,null,null,null,null,null,null,null,null,null,null,null,null,null,null,null,null,null,null,null,null,null,null,null,null,null,{"$f":"EN117+$DW$13","v":{"$error":"#VALUE!"}},{"$f":"IF(EN118=\"\",\"\",IF(OR(COUNT($DA$8:$DA$57)=EO117,EO117=\"\"),\"\",FREQUENCY($DA$8:$DA$57,EN118)))","v":{"$error":"#VALUE!"}},{"$f":"IF(EO118=\"\",\"\",EO118-EO117)","v":{"$error":"#VALUE!"}},{"$error":"#VALUE!"},{"$f":"IF(EP118=\"\",\"\",ER117+EQ118)","v":{"$error":"#VALUE!"}},{"$f":"IF(ER118=\"\",\"\",_xlfn.NUMBERVALUE(Visualization!$L$20))","v":{"$error":"#VALUE!"}},{"$f":"IF(ER118=\"\",\"\",_xlfn.NUMBERVALUE(Visualization!$L$21))","v":{"$error":"#VALUE!"}},{"$error":"#VALUE!"},{"$f":"IF(EU118=\"\",\"\",IF(Visualization!$F$21=\"\",0,_xlfn.NUMBERVALUE(Visualization!$F$21)))","v":{"$error":"#VALUE!"}},null,null,{"$f":"IFERROR(_xlfn.WEIBULL.DIST(EN118,$CR$44,$CR$45,FALSE),\"#N/A\")","v":"#N/A"},null,{"$f":"IF(EO118=\"\",\"\",_xlfn.WEIBULL.DIST(EN118,$CR$45,$CR$44,TRUE)*100)","v":{"$error":"#VALUE!"}},null,{"$f":"IFERROR(IF(EN118<=0,#N/A,((EXP(-((((EN118-$EC$28)/$EC$29)^2)/2))+EXP(-((((EN118+$EC$28)/$EC$29)^2)/2)))/($EC$29*SQRT(2*PI())))),0)","v":0},null,{"$f":"IF(ER118=\"\",\"\",(_xlfn.NORM.DIST(EN118,$EC$23,$EC$24,1)-0/(1-0))*100)","v":{"$error":"#VALUE!"}},null,{"$error":"#VALUE!"},null,{"$f":"IF(ER118=\"\",\"\",_xlfn.WEIBULL.DIST(EN118,2,$CR$44,1)*100)","v":{"$error":"#VALUE!"}}]
[null,null,null,null,null,null,null,null,null,null,null,null,null,null,null,null,null,null,null,"Schwellwert SW [95%]:",null,{"$f":"0.757","v":0.75700000000000001},null,null,"Prüfgrösse A*: ",null,{"$f":"(SUMPRODUCT(AA67:AA116,AB67:AB116)-$DW$8)*(1+1/(5*$DW$8^0.5))","v":{"$error":"#VALUE!"}},null,null,null,null,null,null,null,null,null,null,null,null,null,null,null,null,null,null,null,null,null,null,null,null,null,null,null,null,null,null,null,null,null,null,null,null,null,null,null,null,null,null,null,null,null,null,null,null,null,null,null,null,null,null,null,null,null,null,null,null,null,null,null,null,null,null,null,null,null,null,null,null,null,null,null,null,null,null,null,null,null,null,null,null,null,null,null,null,null,null,null,null,null,null,null,null,null,null,null,null,null,null,null,null,null,null,null,null,null,null,null,null,null,null,null,null,{"$f":"EN118+$DW$13","v":{"$error":"#VALUE!"}},{"$f":"IF(EN119=\"\",\"\",IF(OR(COUNT($DA$8:$DA$57)=EO118,EO118=\"\"),\"\",FREQUENCY($DA$8:$DA$57,EN119)))","v":{"$error":"#VALUE!"}},{"$error":"#VALUE!"},{"$error":"#VALUE!"},{"$error":"#VALUE!"},{"$f":"IF(ER119=\"\",\"\",_xlfn.NUMBERVALUE(Visualization!$L$20))","v":{"$error":"#VALUE!"}},{"$f":"IF(ER119=\"\",\"\",_xlfn.NUMBERVALUE(Visualization!$L$21))","v":{"$error":"#VALUE!"}},{"$error":"#VALUE!"},{"$f":"IF(EU119=\"\",\"\",IF(Visualization!$F$21=\"\",0,_xlfn.NUMBERVALUE(Visualization!$F$21)))","v":{"$error":"#VALUE!"}},null,null,"#N/A",null,{"$error":"#VALUE!"},null,0,null,{"$error":"#VALUE!"},null,{"$error":"#VALUE!"},null,{"$error":"#VALUE!"}]
[null,null,null,null,null,null,null,null,null,null,null,null,null,null,null,null,null,null,null,null,null,null,null,null,null,null,null,null,null,null,null,null,null,null,null,null,null,null,null,null,null,null,null,null,null,null,null,null,null,null,null,null,null,null,null,null,null,null,null,null,null,null,null,null,null,null,null,null,null,null,null,null,null,null,null,null,null,null,null,null,null,null,null,null,null,null,null,null,null,null,null,null,null,null,null,null,null,null,null,null,null,null,null,null,null,null,null,null,null,null,null,null,null,null,null,null,null,null,null,null,null,null,null,null,null,null,null,null,null,null,null,null,null,null,null,null,null,null,null,null,null,null,null,{"$error":"#VALUE!"},{"$f":"IF(EN120=\"\",\"\",IF(OR(COUNT($DA$8:$DA$57)=EO119,EO119=\"\"),\"\",FREQUENCY($DA$8:$DA$57,EN120)))","v":{"$error":"#VALUE!"}},{"$error":"#VALUE!"},{"$error":"#VALUE!"},{"$error":"#VALUE!"},{"$f":"IF(ER120=\"\",\"\",_xlfn.NUMBERVALUE(Visualization!$L$20))","v":{"$error":"#VALUE!"}},{"$f":"IF(ER120=\"\",\"\",_xlfn.NUMBERVALUE(Visualization!$L$21))","v":{"$error":"#VALUE!"}},{"$error":"#VALUE!"},{"$f":"IF(EU120=\"\",\"\",IF(Visualization!$F$21=\"\",0,_xlfn.NUMBERVALUE(Visualization!$F$21)))","v":{"$error":"#VALUE!"}},null,null,"#N/A",null,{"$error":"#VALUE!"},null,0,null,{"$error":"#VALUE!"},null,{"$error":"#VALUE!"},null,{"$error":"#VALUE!"}]
[null,null,null,null,null,null,null,null,null,null,null,null,null,null,null,null,null,null,null,null,null,null,null,null,null,null,null,null,null,null,null,null,null,null,null,null,null,null,null,null,null,null,null,null,null,null,null,null,null,null,null,null,null,null,null,null,null,null,null,null,null,null,null,null,null,null,null,null,null,null,null,null,null,null,null,null,null,null,null,null,null,null,null,null,null,null,null,null,null,null,null,null,null,null,null,null,null,null,null,null,null,null,null,null,null,null,null,null,null,null,null,null,null,null,null,null,null,null,null,null,null,null,null,null,null,null,null,null,null,null,null,null,null,null,null,null,null,null,null,null,null,null,null,{"$error":"#VALUE!"},{"$error":"#VALUE!"},{"$error":"#VALUE!"},{"$error":"#VALUE!"},{"$error":"#VALUE!"},{"$f":"IF(ER121=\"\",\"\",_xlfn.NUMBERVALUE(Visualization!$L$20))","v":{"$error":"#VALUE!"}},{"$f":"IF(ER121=\"\",\"\",_xlfn.NUMBERVALUE(Visualization!$L$21))","v":{"$error":"#VALUE!"}},{"$error":"#VALUE!"},{"$f":"IF(EU121=\"\",\"\",IF(Visualization!$F$21=\"\",0,_xlfn.NUMBERVALUE(Visualization!$F$21)))","v":{"$error":"#VALUE!"}},null,null,"#N/A",null,{"$error":"#VALUE!"},null,0,null,{"$error":"#VALUE!"},null,{"$error":"#VALUE!"},null,{"$error":"#VALUE!"}]
[null,null,null,null,null,null,null,null,"Test value (AD)",null,null,null,null,null,null,null,null,null,null,null,null,null,null,null,null,null,null,null,null,null,"Nr.","Value","Values (sorted)","(Rang-1)/n","tats.Kum.Part","Difference",null,"Threshold values",null,null,null,null,null,null,null,null,null,null,null,null,null,null,null,null,null,null,null,null,null,null,null,null,null,null,null,null,null,null,null,null,null,null,null,null,null,null,null,null,null,null,null,null,null,null,null,null,null,null,null,null,null,null,null,null,null,null,null,null,null,null,null,null,null,null,null,null,null,null,null,null,null,null,null,null,null,null,null,null,null,null,null,null,null,null,null,null,null,null,null,null,null,null,null,null,null,null,null,null,null,null,null,null,null,{"$error":"#VALUE!"},{"$error":"#VALUE!"},{"$error":"#VALUE!"},{"$error":"#VALUE!"},{"$error":"#VALUE!"},{"$f":"IF(ER122=\"\",\"\",_xlfn.NUMBERVALUE(Visualization!$L$20))","v":{"$error":"#VALUE!"}},{"$f":"IF(ER122=\"\",\"\",_xlfn.NUMBERVALUE(Visualization!$L$21))","v":{"$error":"#VALUE!"}},{"$error":"#VALUE!"},{"$f":"IF(EU122=\"\",\"\",IF(Visualization!$F$21=\"\",0,_xlfn.NUMBERVALUE(Visualization!$F$21)))","v":{"$error":"#VALUE!"}},null,null,"#N/A",null,{"$error":"#VALUE!"},null,0,null,{"$error":"#VALUE!"},null,{"$error":"#VALUE!"},null,{"$error":"#VALUE!"}]
[null,null,null,null,null,null,null,null,null,null,null,null,null,null,null,null,null,null,null,null,null,null,null,null,null,null,null,null,null,null,null,null,null,null,null,null,null,null,null,null,null,null,null,null,null,null,null,null,null,null,null,null,null,null,null,null,null,null,null,null,null,null,null,null,null,null,null,null,null,null,null,null,null,null,null,null,null,null,null,null,null,null,null,null,null,null,null,null,null,null,null,null,null,null,null,null,null,null,null,null,null,null,null,null,null,null,null,null,null,null,null,null,null,null,null,null,null,null,null,null,null,null,null,null,null,null,null,null,null,null,null,null,null,null,null,null,null,null,null,null,null,null,null,{"$error":"#VALUE!"},{"$error":"#VALUE!"},{"$error":"#VALUE!"},{"$error":"#VALUE!"},{"$error":"#VALUE!"},{"$f":"IF(ER123=\"\",\"\",_xlfn.NUMBERVALUE(Visualization!$L$20))","v":{"$error":"#VALUE!"}},{"$f":"IF(ER123=\"\",\"\",_xlfn.NUMBERVALUE(Visualization!$L$21))","v":{"$error":"#VALUE!"}},{"$error":"#VALUE!"},{"$f":"IF(EU123=\"\",\"\",IF(Visualization!$F$21=\"\",0,_xlfn.NUMBERVALUE(Visualization!$F$21)))","v":{"$error":"#VALUE!"}},null,null,"#N/A",null,{"$error":"#VALUE!"},null,0,null,{"$error":"#VALUE!"},null,{"$error":"#VALUE!"},null,{"$error":"#VALUE!"}]
[null,null,null,null,null,null,null,null,{"$f":"_xlfn.CHISQ.TEST(INDEX($ER$8:$ER$49,COUNTIF(Calculation!$ER$8:$ER$49,0)+1,1):INDEX($ER$8:$ER$49,COUNT(Calculation!$ER$8:$ER$49)-COUNTIF(Calculation!$ER$8:$ER$49,0)+1,1),INDEX($EY$7:$EY$48,COUNTIF(Calculation!$ER$8:$ER$49,0)+1,1):INDEX($EY$7:$EY$48,COUNT(Calculation!$ER$8:$ER$49)-COUNTIF(Calculation!$ER$8:$ER$49,0)+1,1))","v":{"$error":"#VALUE!"}},null,"≥",0.75,null,"The Chi-Square test focus on the peripheral areas of the distribution.",null,null,null,null,null,null,null,null,null,null,null,null,null,null,null,null,{"$f":"IF(Values!$D$13=\"\",\"\",1)","v":""},{"$f":"DB8","v":""},{"$f":"IF(AE124=\"\",\"\",LARGE($AF$124:$AF$173,AE124))","v":""},{"$f":"IF(AE124=\"\",\"\",(AE124-1)/COUNT($AE$124:$AE$173))","v":""},{"$f":"IF(AG124=\"\",\"\",_xlfn.NORM.DIST(AG124,$CI$6,$EF$14,1))","v":""},{"$f":"IF(AH124=\"\",\"\",ABS(AH124-AI124))","v":""},null,"n","α 0,05",null,null,null,null,null,null,null,null,null,null,null,null,null,null,null,null,null,null,null,null,null,null,null,null,null,null,null,null,null,null,null,null,null,null,null,null,null,null,null,null,null,null,null,null,null,null,null,null,null,null,null,null,null,null,null,null,null,null,null,null,null,null,null,null,null,null,null,null,null,null,null,null,null,null,null,null,null,null,null,null,null,null,null,null,null,null,null,null,null,null,null,null,null,null,null,null,null,null,null,null,null,null,null,null,{"$error":"#VALUE!"},{"$error":"#VALUE!"},{"$error":"#VALUE!"},{"$error":"#VALUE!"},{"$error":"#VALUE!"},{"$f":"IF(ER124=\"\",\"\",_xlfn.NUMBERVALUE(Visualization!$L$20))","v":{"$error":"#VALUE!"}},{"$f":"IF(ER124=\"\",\"\",_xlfn.NUMBERVALUE(Visualization!$L$21))","v":{"$error":"#VALUE!"}},{"$error":"#VALUE!"},{"$f":"IF(EU124=\"\",\"\",IF(Visualization!$F$21=\"\",0,_xlfn.NUMBERVALUE(Visualization!$F$21)))","v":{"$error":"#VALUE!"}},null,null,"#N/A",null,{"$error":"#VALUE!"},null,0,null,{"$error":"#VALUE!"},null,{"$error":"#VALUE!"},null,{"$error":"#VALUE!"}]
[null,null,null,null,null,null,null,null,null,null,null,null,null,null,null,null,null,null,null,null,null,null,null,null,null,null,null,null,null,null,{"$f":"IF(Values!$D$14=\"\",\"\",2)","v":""},"","","","",{"$f":"IF(AH125=\"\",\"\",ABS(AH125-AI125))","v":""},null,1,0.97499999999999998,null,null,null,null,null,null,null,null,null,null,null,null,null,null,null,null,null,null,null,null,null,null,null,null,null,null,null,null,null,null,null,null,null,null,null,null,null,null,null,null,null,null,null,null,null,null,null,null,null,null,null,null,null,null,null,null,null,null,null,null,null,null,null,null,null,null,null,null,null,null,null,null,null,null,null,null,null,null,null,null,null,null,null,null,null,null,null,null,null,null,null,null,null,null,null,null,null,null,null,null,null,null,null,null,{"$error":"#VALUE!"},{"$error":"#VALUE!"},{"$error":"#VALUE!"},{"$error":"#VALUE!"},{"$error":"#VALUE!"},{"$f":"IF(ER125=\"\",\"\",_xlfn.NUMBERVALUE(Visualization!$L$20))","v":{"$error":"#VALUE!"}},{"$f":"IF(ER125=\"\",\"\",_xlfn.NUMBERVALUE(Visualization!$L$21))","v":{"$error":"#VALUE!"}},{"$error":"#VALUE!"},{"$f":"IF(EU125=\"\",\"\",IF(Visualization!$F$21=\"\",0,_xlfn.NUMBERVALUE(Visualization!$F$21)))","v":{"$error":"#VALUE!"}},null,null,"#N/A",null,{"$error":"#VALUE!"},null,0,null,{"$error":"#VALUE!"},null,{"$error":"#VALUE!"},null,{"$error":"#VALUE!"}]
[null,null,null,null,null,null,null,null,null,null,null,null,null,null,null,null,null,null,null,null,null,null,null,null,null,null,null,null,null,null,{"$f":"IF(Values!$D$15=\"\",\"\",3)","v":""},"","","","","",null,2,0.84187000000000001,null,null,null,null,null,null,null,null,null,null,null,null,null,null,null,null,null,null,null,null,null,null,null,null,null,null,null,null,null,null,null,null,null,null,null,null,null,null,null,null,null,null,null,null,null,null,null,null,null,null,null,null,null,null,null,null,null,null,null,null,null,null,null,null,null,null,null,null,null,null,null,null,null,null,null,null,null,null,null,null,null,null,null,null,null,null,null,null,null,null,null,null,null,null,null,null,null,null,null,null,null,null,null,null,{"$error":"#VALUE!"},{"$error":"#VALUE!"},{"$error":"#VALUE!"},{"$error":"#VALUE!"},{"$error":"#VALUE!"},{"$f":"IF(ER126=\"\",\"\",_xlfn.NUMBERVALUE(Visualization!$L$20))","v":{"$error":"#VALUE!"}},{"$f":"IF(ER126=\"\",\"\",_xlfn.NUMBERVALUE(Visualization!$L$21))","v":{"$error":"#VALUE!"}},{"$error":"#VALUE!"},{"$f":"IF(EU126=\"\",\"\",IF(Visualization!$F$21=\"\",0,_xlfn.NUMBERVALUE(Visualization!$F$21)))","v":{"$error":"#VALUE!"}},null,null,"#N/A",null,{"$error":"#VALUE!"},null,0,null,{"$error":"#VALUE!"},null,{"$error":"#VALUE!"},null,{"$error":"#VALUE!"}]
[null,null,null,null,null,null,null,null,null,null,null,null,null,null,null,null,null,null,null,null,null,null,null,null,null,null,null,null,null,null,{"$f":"IF(Values!$D$16=\"\",\"\",4)","v":""},"","","","","",null,3,0.70757999999999999,null,null,null,null,null,null,null,null,null,null,null,null,null,null,null,null,null,null,null,null,null,null,null,null,null,null,null,null,null,null,null,null,null,null,null,null,null,null,null,null,null,null,null,null,null,null,null,null,null,null,null,null,null,null,null,null,null,null,null,null,null,null,null,null,null,null,null,null,null,null,null,null,null,null,null,null,null,null,null,null,null,null,null,null,null,null,null,null,null,null,null,null,null,null,null,null,null,null,null,null,null,null,null,null,{"$error":"#VALUE!"},{"$f":"IF(EN127=\"\",\"\",IF(OR(COUNT($DA$8:$DA$57)=EO126,EO126=\"\"),\"\",FREQUENCY($DA$8:$DA$57,EN127)))","v":{"$error":"#VALUE!"}},{"$error":"#VALUE!"},{"$error":"#VALUE!"},{"$error":"#VALUE!"},{"$f":"IF(ER127=\"\",\"\",_xlfn.NUMBERVALUE(Visualization!$L$20))","v":{"$error":"#VALUE!"}},{"$f":"IF(ER127=\"\",\"\",_xlfn.NUMBERVALUE(Visualization!$L$21))","v":{"$error":"#VALUE!"}},{"$error":"#VALUE!"},{"$f":"IF(EU127=\"\",\"\",IF(Visualization!$F$21=\"\",0,_xlfn.NUMBERVALUE(Visualization!$F$21)))","v":{"$error":"#VALUE!"}},null,null,"#N/A",null,{"$error":"#VALUE!"},null,0,null,{"$error":"#VALUE!"},null,{"$error":"#VALUE!"},null,{"$error":"#VALUE!"}]
[null,null,null,null,null,null,null,null,"H1 = True If AD > SW",null,null,"H1: Values are normal ditributed",null,null,null,null,null,null,null,null,null,null,null,null,null,null,null,null,null,null,{"$f":"IF(Values!$D$17=\"\",\"\",5)","v":""},"","","","","",null,4,0.62392000000000003,null,null,null,null,null,null,null,null,null,null,null,null,null,null,null,null,null,null,null,null,null,null,null,null,null,null,null,null,null,null,null,null,null,null,null,null,null,null,null,null,null,null,null,null,null,null,null,null,null,null,null,null,null,null,null,null,null,null,null,null,null,null,null,null,null,null,null,null,null,null,null,null,null,null,null,null,null,null,null,null,null,null,null,null,null,null,null,null,null,null,null,null,null,null,null,null,null,null,null,null,null,null,null,null,{"$error":"#VALUE!"},{"$f":"IF(EN128=\"\",\"\",IF(OR(COUNT($DA$8:$DA$57)=EO127,EO127=\"\"),\"\",FREQUENCY($DA$8:$DA$57,EN128)))","v":{"$error":"#VALUE!"}},{"$error":"#VALUE!"},{"$error":"#VALUE!"},{"$error":"#VALUE!"},{"$f":"IF(ER128=\"\",\"\",_xlfn.NUMBERVALUE(Visualization!$L$20))","v":{"$error":"#VALUE!"}},{"$f":"IF(ER128=\"\",\"\",_xlfn.NUMBERVALUE(Visualization!$L$21))","v":{"$error":"#VALUE!"}},{"$error":"#VALUE!"},{"$f":"IF(EU128=\"\",\"\",IF(Visualization!$F$21=\"\",0,_xlfn.NUMBERVALUE(Visualization!$F$21)))","v":{"$error":"#VALUE!"}},null,null,"#N/A",{"$f":"EP128","v":{"$error":"#VALUE!"}},{"$error":"#VALUE!"},{"$f":"IFERROR(((EP128-FA128)^2/FA128),\"\")","v":""},0,null,{"$error":"#VALUE!"},null,{"$error":"#VALUE!"},null,{"$error":"#VALUE!"}]
[null,null,null,null,null,null,null,null,"H0 = True If AD < SW",null,null,"H0: Values are not normal distributed",null,null,null,null,null,null,null,null,null,null,null,null,null,null,null,null,null,null,{"$f":"IF(Values!$D$18=\"\",\"\",6)","v":""},"","","","","",null,5,0.56325999999999998,null,null,null,null,null,null,null,null,null,null,null,null,null,null,null,null,null,null,null,null,null,null,null,null,null,null,null,null,null,null,null,null,null,null,null,null,null,null,null,null,null,null,null,null,null,null,null,null,null,null,null,null,null,null,null,null,null,null,null,null,null,null,null,null,null,null,null,null,null,null,null,null,null,null,null,null,null,null,null,null,null,null,null,null,null,null,null,null,null,null,null,null,null,null,null,null,null,null,null,null,null,null,null,null,{"$error":"#VALUE!"},{"$f":"IF(EN129=\"\",\"\",IF(OR(COUNT($DA$8:$DA$57)=EO128,EO128=\"\"),\"\",FREQUENCY($DA$8:$DA$57,EN129)))","v":{"$error":"#VALUE!"}},{"$error":"#VALUE!"},{"$error":"#VALUE!"},{"$error":"#VALUE!"},{"$f":"IF(ER129=\"\",\"\",_xlfn.NUMBERVALUE(Visualization!$L$20))","v":{"$error":"#VALUE!"}},{"$f":"IF(ER129=\"\",\"\",_xlfn.NUMBERVALUE(Visualization!$L$21))","v":{"$error":"#VALUE!"}},{"$error":"#VALUE!"},{"$f":"IF(EU129=\"\",\"\",IF(Visualization!$F$21=\"\",0,_xlfn.NUMBERVALUE(Visualization!$F$21)))","v":{"$error":"#VALUE!"}},null,null,"#N/A",{"$error":"#VALUE!"},{"$error":"#VALUE!"},"",0,null,{"$error":"#VALUE!"},null,{"$error":"#VALUE!"},null,{"$error":"#VALUE!"}]
[null,null,null,null,null,null,null,null,null,null,null,null,null,null,null,null,null,null,null,null,null,null,null,null,null,null,null,null,null,null,{"$f":"IF(Values!$D$19=\"\",\"\",7)","v":""},"","","","","",null,6,0.51924999999999999,null,null,null,null,null,null,null,null,null,null,null,null,null,null,null,null,null,null,null,null,null,null,null,null,null,null,null,null,null,null,null,null,null,null,null,null,null,null,null,null,null,null,null,null,null,null,null,null,null,null,null,null,null,null,null,null,null,null,null,null,null,null,null,null,null,null,null,null,null,null,null,null,null,null,null,null,null,null,null,null,null,null,null,null,null,null,null,null,null,null,null,null,null,null,null,null,null,null,null,null,null,null,null,null,{"$error":"#VALUE!"},{"$error":"#VALUE!"},{"$error":"#VALUE!"},{"$error":"#VALUE!"},{"$error":"#VALUE!"},{"$f":"IF(ER130=\"\",\"\",_xlfn.NUMBERVALUE(Visualization!$L$20))","v":{"$error":"#VALUE!"}},{"$f":"IF(ER130=\"\",\"\",_xlfn.NUMBERVALUE(Visualization!$L$21))","v":{"$error":"#VALUE!"}},{"$error":"#VALUE!"},{"$f":"IF(EU130=\"\",\"\",IF(Visualization!$F$21=\"\",0,_xlfn.NUMBERVALUE(Visualization!$F$21)))","v":{"$error":"#VALUE!"}},null,null,"#N/A",{"$error":"#VALUE!"},{"$error":"#VALUE!"},"",0,null,{"$error":"#VALUE!"},null,{"$error":"#VALUE!"},null,{"$error":"#VALUE!"}]
[null,null,null,null,null,null,null,null,null,null,null,null,null,null,null,null,null,null,null,null,null,null,null,null,null,null,null,null,null,null,{"$f":"IF(Values!$D$20=\"\",\"\",8)","v":""},"","","","","",null,7,0.48341000000000001,null,null,null,null,null,null,null,null,null,null,null,null,null,null,null,null,null,null,null,null,null,null,null,null,null,null,null,null,null,null,null,null,null,null,null,null,null,null,null,null,null,null,null,null,null,null,null,null,null,null,null,null,null,null,null,null,null,null,null,null,null,null,null,null,null,null,null,null,null,null,null,null,null,null,null,null,null,null,null,null,null,null,null,null,null,null,null,null,null,null,null,null,null,null,null,null,null,null,null,null,null,null,null,null,{"$error":"#VALUE!"},{"$error":"#VALUE!"},{"$error":"#VALUE!"},{"$error":"#VALUE!"},{"$error":"#VALUE!"},{"$f":"IF(ER131=\"\",\"\",_xlfn.NUMBERVALUE(Visualization!$L$20))","v":{"$error":"#VALUE!"}},{"$f":"IF(ER131=\"\",\"\",_xlfn.NUMBERVALUE(Visualization!$L$21))","v":{"$error":"#VALUE!"}},{"$error":"#VALUE!"},{"$f":"IF(EU131=\"\",\"\",IF(Visualization!$F$21=\"\",0,_xlfn.NUMBERVALUE(Visualization!$F$21)))","v":{"$error":"#VALUE!"}},null,null,"#N/A",{"$error":"#VALUE!"},{"$error":"#VALUE!"},"",0,null,{"$error":"#VALUE!"},null,{"$error":"#VALUE!"},null,{"$error":"#VALUE!"}]
[null,null,null,null,null,null,null,null,null,null,null,null,null,null,null,null,null,null,null,null,null,null,null,null,null,null,null,null,null,null,{"$f":"IF(Values!$D$21=\"\",\"\",9)","v":""},"","","","","",null,8,0.45426,null,null,null,null,null,null,null,null,null,null,null,null,null,null,null,null,null,null,null,null,null,null,null,null,null,null,null,null,null,null,null,null,null,null,null,null,null,null,null,null,null,null,null,null,null,null,null,null,null,null,null,null,null,null,null,null,null,null,null,null,null,null,null,null,null,null,null,null,null,null,null,null,null,null,null,null,null,null,null,null,null,null,null,null,null,null,null,null,null,null,null,null,null,null,null,null,null,null,null,null,null,null,null,null,{"$error":"#VALUE!"},{"$error":"#VALUE!"},{"$error":"#VALUE!"},{"$error":"#VALUE!"},{"$error":"#VALUE!"},{"$f":"IF(ER132=\"\",\"\",_xlfn.NUMBERVALUE(Visualization!$L$20))","v":{"$error":"#VALUE!"}},{"$f":"IF(ER132=\"\",\"\",_xlfn.NUMBERVALUE(Visualization!$L$21))","v":{"$error":"#VALUE!"}},{"$error":"#VALUE!"},{"$f":"IF(EU132=\"\",\"\",IF(Visualization!$F$21=\"\",0,_xlfn.NUMBERVALUE(Visualization!$F$21)))","v":{"$error":"#VALUE!"}},null,null,"#N/A",{"$error":"#VALUE!"},{"$error":"#VALUE!"},"",0,null,{"$error":"#VALUE!"},null,{"$error":"#VALUE!"},null,{"$error":"#VALUE!"}]
[null,null,null,null,null,null,null,null,null,null,null,null,null,null,null,null,null,null,null,null,null,null,null,null,null,null,null,null,null,null,{"$f":"IF(Values!$D$22=\"\",\"\",10)","v":""},"","","","","",null,9,0.43,null,null,null,null,null,null,null,null,null,null,null,null,null,null,null,null,null,null,null,null,null,null,null,null,null,null,null,null,null,null,null,null,null,null,null,null,null,null,null,null,null,null,null,null,null,null,null,null,null,null,null,null,null,null,null,null,null,null,null,null,null,null,null,null,null,null,null,null,null,null,null,null,null,null,null,null,null,null,null,null,null,null,null,null,null,null,null,null,null,null,null,null,null,null,null,null,null,null,null,null,null,null,null,null,{"$error":"#VALUE!"},{"$error":"#VALUE!"},{"$error":"#VALUE!"},{"$error":"#VALUE!"},{"$error":"#VALUE!"},{"$f":"IF(ER133=\"\",\"\",_xlfn.NUMBERVALUE(Visualization!$L$20))","v":{"$error":"#VALUE!"}},{"$f":"IF(ER133=\"\",\"\",_xlfn.NUMBERVALUE(Visualization!$L$21))","v":{"$error":"#VALUE!"}},{"$error":"#VALUE!"},{"$f":"IF(EU133=\"\",\"\",IF(Visualization!$F$21=\"\",0,_xlfn.NUMBERVALUE(Visualization!$F$21)))","v":{"$error":"#VALUE!"}},null,null,"#N/A",{"$error":"#VALUE!"},{"$error":"#VALUE!"},"",0,null,{"$error":"#VALUE!"},null,{"$error":"#VALUE!"},null,{"$error":"#VALUE!"}]
[null,null,null,null,null,null,null,null,null,null,null,null,null,null,null,null,null,null,null,null,null,null,null,null,null,null,null,null,null,null,{"$f":"IF(Values!$D$23=\"\",\"\",11)","v":""},"","","","","",null,10,0.40923999999999999,null,null,null,null,null,null,null,null,null,null,null,null,null,null,null,null,null,null,null,null,null,null,null,null,null,null,null,null,null,null,null,null,null,null,null,null,null,null,null,null,null,null,null,null,null,null,null,null,null,null,null,null,null,null,null,null,null,null,null,null,null,null,null,null,null,null,null,null,null,null,null,null,null,null,null,null,null,null,null,null,null,null,null,null,null,null,null,null,null,null,null,null,null,null,null,null,null,null,null,null,null,null,null,null,{"$error":"#VALUE!"},{"$error":"#VALUE!"},{"$error":"#VALUE!"},{"$error":"#VALUE!"},{"$error":"#VALUE!"},{"$f":"IF(ER134=\"\",\"\",_xlfn.NUMBERVALUE(Visualization!$L$20))","v":{"$error":"#VALUE!"}},{"$f":"IF(ER134=\"\",\"\",_xlfn.NUMBERVALUE(Visualization!$L$21))","v":{"$error":"#VALUE!"}},{"$error":"#VALUE!"},{"$f":"IF(EU134=\"\",\"\",IF(Visualization!$F$21=\"\",0,_xlfn.NUMBERVALUE(Visualization!$F$21)))","v":{"$error":"#VALUE!"}},null,null,"#N/A",{"$error":"#VALUE!"},{"$error":"#VALUE!"},"",0,null,{"$error":"#VALUE!"},null,{"$error":"#VALUE!"},null,{"$error":"#VALUE!"}]
[null,null,null,null,null,null,null,null,"Nr.","Value","Values (sorted)","(Rang-1)/n","tats.Kum.Part","Difference",null,"Threshold values",null,null,null,null,null,null,null,null,null,null,null,null,null,null,{"$f":"IF(Values!$D$24=\"\",\"\",12)","v":""},"","","","","",null,11,0.39121,null,null,null,null,null,null,null,null,null,null,null,null,null,null,null,null,null,null,null,null,null,null,null,null,null,null,null,null,null,null,null,null,null,null,null,null,null,null,null,null,null,null,null,null,null,null,null,null,null,null,null,null,null,null,null,null,null,null,null,null,null,null,null,null,null,null,null,null,null,null,null,null,null,null,null,null,null,null,null,null,null,null,null,null,null,null,null,null,null,null,null,null,null,null,null,null,null,null,null,null,null,null,null,null,{"$error":"#VALUE!"},{"$error":"#VALUE!"},{"$error":"#VALUE!"},{"$error":"#VALUE!"},{"$error":"#VALUE!"},{"$f":"IF(ER135=\"\",\"\",_xlfn.NUMBERVALUE(Visualization!$L$20))","v":{"$error":"#VALUE!"}},{"$f":"IF(ER135=\"\",\"\",_xlfn.NUMBERVALUE(Visualization!$L$21))","v":{"$error":"#VALUE!"}},{"$error":"#VALUE!"},{"$f":"IF(EU135=\"\",\"\",IF(Visualization!$F$21=\"\",0,_xlfn.NUMBERVALUE(Visualization!$F$21)))","v":{"$error":"#VALUE!"}},null,null,"#N/A",{"$error":"#VALUE!"},{"$error":"#VALUE!"},"",0,null,{"$error":"#VALUE!"},null,{"$error":"#VALUE!"},null,{"$error":"#VALUE!"}]
[null,null,null,null,null,null,null,null,null,null,null,null,null,null,null,null,null,null,null,null,null,null,null,null,null,null,null,null,null,null,{"$f":"IF(Values!$D$25=\"\",\"\",13)","v":""},"","","","","",null,12,0.37541999999999998,null,null,null,null,null,null,null,null,null,null,null,null,null,null,null,null,null,null,null,null,null,null,null,null,null,null,null,null,null,null,null,null,null,null,null,null,null,null,null,null,null,null,null,null,null,null,null,null,null,null,null,null,null,null,null,null,null,null,null,null,null,null,null,null,null,null,null,null,null,null,null,null,null,null,null,null,null,null,null,null,null,null,null,null,null,null,null,null,null,null,null,null,null,null,null,null,null,null,null,null,null,null,null,null,{"$error":"#VALUE!"},{"$error":"#VALUE!"},{"$error":"#VALUE!"},{"$error":"#VALUE!"},{"$error":"#VALUE!"},{"$f":"IF(ER136=\"\",\"\",_xlfn.NUMBERVALUE(Visualization!$L$20))","v":{"$error":"#VALUE!"}},{"$f":"IF(ER136=\"\",\"\",_xlfn.NUMBERVALUE(Visualization!$L$21))","v":{"$error":"#VALUE!"}},{"$error":"#VALUE!"},{"$f":"IF(EU136=\"\",\"\",IF(Visualization!$F$21=\"\",0,_xlfn.NUMBERVALUE(Visualization!$F$21)))","v":{"$error":"#VALUE!"}},null,null,"#N/A",{"$error":"#VALUE!"},{"$error":"#VALUE!"},"",0,null,{"$error":"#VALUE!"},null,{"$error":"#VALUE!"},null,{"$error":"#VALUE!"}]
[null,null,null,null,null,null,null,null,{"$f":"IF(Values!$D$13=\"\",\"\",1)","v":""},{"$f":"DA8","v":""},{"$f":"IF(I137=\"\",\"\",LARGE($J$137:$J$186,I137))","v":""},{"$f":"IF(I137=\"\",\"\",(I137-1)/COUNT($I$137:$I$186))","v":""},{"$f":"IF(K137=\"\",\"\",_xlfn.NORM.DIST(K137,$BQ$6,$DW$14,1))","v":""},{"$f":"IF(L137=\"\",\"\",ABS(L137-M137))","v":""},null,"n","α 0,05",null,null,null,null,null,null,null,null,null,null,null,null,null,{"$f":"IF(Values!$D$26=\"\",\"\",14)","v":""},"","","","","",null,13,0.36142000000000002,null,null,null,null,null,null,null,null,null,null,null,null,null,null,null,null,null,null,null,null,null,null,null,null,null,null,null,null,null,null,null,null,null,null,null,null,null,null,null,null,null,null,null,null,null,null,null,null,null,null,null,null,null,null,null,null,null,null,null,null,null,null,null,null,null,null,null,null,null,null,null,null,null,null,null,null,null,null,null,null,null,null,null,null,null,null,null,null,null,null,null,null,null,null,null,null,null,null,null,null,null,null,null,null,{"$error":"#VALUE!"},{"$error":"#VALUE!"},{"$error":"#VALUE!"},{"$error":"#VALUE!"},{"$error":"#VALUE!"},{"$f":"IF(ER137=\"\",\"\",_xlfn.NUMBERVALUE(Visualization!$L$20))","v":{"$error":"#VALUE!"}},{"$f":"IF(ER137=\"\",\"\",_xlfn.NUMBERVALUE(Visualization!$L$21))","v":{"$error":"#VALUE!"}},{"$error":"#VALUE!"},{"$f":"IF(EU137=\"\",\"\",IF(Visualization!$F$21=\"\",0,_xlfn.NUMBERVALUE(Visualization!$F$21)))","v":{"$error":"#VALUE!"}},null,null,"#N/A",{"$error":"#VALUE!"},{"$error":"#VALUE!"},"",0,null,{"$error":"#VALUE!"},null,{"$error":"#VALUE!"},null,{"$error":"#VALUE!"}]
[null,null,null,null,null,null,null,null,{"$f":"IF(Values!$D$14=\"\",\"\",2)","v":""},"","","","",{"$f":"IF(L138=\"\",\"\",ABS(L138-M138))","v":""},null,1,0.97499999999999998,null,null,null,null,null,null,null,null,null,null,null,null,null,{"$f":"IF(Values!$D$27=\"\",\"\",15)","v":""},"","","","","",null,14,0.34888999999999998,null,null,null,null,null,null,null,null,null,null,null,null,null,null,null,null,null,null,null,null,null,null,null,null,null,null,null,null,null,null,null,null,null,null,null,null,null,null,null,null,null,null,null,null,null,null,null,null,null,null,null,null,null,null,null,null,null,null,null,null,null,null,null,null,null,null,null,null,null,null,null,null,null,null,null,null,null,null,null,null,null,null,null,null,null,null,null,null,null,null,null,null,null,null,null,null,null,null,null,null,null,null,null,null,{"$error":"#VALUE!"},{"$error":"#VALUE!"},{"$error":"#VALUE!"},{"$error":"#VALUE!"},{"$error":"#VALUE!"},{"$f":"IF(ER138=\"\",\"\",_xlfn.NUMBERVALUE(Visualization!$L$20))","v":{"$error":"#VALUE!"}},{"$f":"IF(ER138=\"\",\"\",_xlfn.NUMBERVALUE(Visualization!$L$21))","v":{"$error":"#VALUE!"}},{"$error":"#VALUE!"},{"$f":"IF(EU138=\"\",\"\",IF(Visualization!$F$21=\"\",0,_xlfn.NUMBERVALUE(Visualization!$F$21)))","v":{"$error":"#VALUE!"}},null,null,"#N/A",{"$error":"#VALUE!"},{"$error":"#VALUE!"},"",0,null,{"$error":"#VALUE!"},null,{"$error":"#VALUE!"},null,{"$error":"#VALUE!"}]
[null,null,null,null,null,null,null,null,{"$f":"IF(Values!$D$15=\"\",\"\",3)","v":""},"","","","","",null,2,0.84187000000000001,null,null,null,null,null,null,null,null,null,null,null,null,null,{"$f":"IF(Values!$D$28=\"\",\"\",16)","v":""},"","","","","",null,15,0.33759,null,null,null,null,null,null,null,null,null,null,null,null,null,null,null,null,null,null,null,null,null,null,null,null,null,null,null,null,null,null,null,null,null,null,null,null,null,null,null,null,null,null,null,null,null,null,null,null,null,null,null,null,null,null,null,null,null,null,null,null,null,null,null,null,null,null,null,null,null,null,null,null,null,null,null,null,null,null,null,null,null,null,null,null,null,null,null,null,null,null,null,null,null,null,null,null,null,null,null,null,null,null,null,null,{"$error":"#VALUE!"},{"$error":"#VALUE!"},{"$error":"#VALUE!"},{"$error":"#VALUE!"},{"$error":"#VALUE!"},{"$f":"IF(ER139=\"\",\"\",_xlfn.NUMBERVALUE(Visualization!$L$20))","v":{"$error":"#VALUE!"}},{"$f":"IF(ER139=\"\",\"\",_xlfn.NUMBERVALUE(Visualization!$L$21))","v":{"$error":"#VALUE!"}},{"$error":"#VALUE!"},{"$f":"IF(EU139=\"\",\"\",IF(Visualization!$F$21=\"\",0,_xlfn.NUMBERVALUE(Visualization!$F$21)))","v":{"$error":"#VALUE!"}},null,null,"#N/A",{"$error":"#VALUE!"},{"$error":"#VALUE!"},"",0,null,{"$error":"#VALUE!"},null,{"$error":"#VALUE!"},null,{"$error":"#VALUE!"}]
[null,null,null,null,null,null,null,null,{"$f":"IF(Values!$D$16=\"\",\"\",4)","v":""},"","","","","",null,3,0.70757999999999999,null,null,null,null,null,null,null,null,null,null,null,null,null,{"$f":"IF(Values!$D$29=\"\",\"\",17)","v":""},"","","","","",null,16,0.32733000000000001,null,null,null,null,null,null,null,null,null,null,null,null,null,null,null,null,null,null,null,null,null,null,null,null,null,null,null,null,null,null,null,null,null,null,null,null,null,null,null,null,null,null,null,null,null,null,null,null,null,null,null,null,null,null,null,null,null,null,null,null,null,null,null,null,null,null,null,null,null,null,null,null,null,null,null,null,null,null,null,null,null,null,null,null,null,null,null,null,null,null,null,null,null,null,null,null,null,null,null,null,null,null,null,null,{"$error":"#VALUE!"},{"$error":"#VALUE!"},{"$error":"#VALUE!"},{"$error":"#VALUE!"},{"$error":"#VALUE!"},{"$f":"IF(ER140=\"\",\"\",_xlfn.NUMBERVALUE(Visualization!$L$20))","v":{"$error":"#VALUE!"}},{"$f":"IF(ER140=\"\",\"\",_xlfn.NUMBERVALUE(Visualization!$L$21))","v":{"$error":"#VALUE!"}},{"$error":"#VALUE!"},{"$f":"IF(EU140=\"\",\"\",IF(Visualization!$F$21=\"\",0,_xlfn.NUMBERVALUE(Visualization!$F$21)))","v":{"$error":"#VALUE!"}},null,null,"#N/A",{"$error":"#VALUE!"},{"$error":"#VALUE!"},"",0,null,{"$error":"#VALUE!"},null,{"$error":"#VALUE!"},null,{"$error":"#VALUE!"}]
[null,null,null,null,null,null,null,null,{"$f":"IF(Values!$D$17=\"\",\"\",5)","v":""},"","","","","",null,4,0.62392000000000003,null,null,null,null,null,null,null,null,null,null,null,null,null,{"$f":"IF(Values!$D$30=\"\",\"\",18)","v":""},"","","","","",null,17,0.31796000000000002,null,null,null,null,null,null,null,null,null,null,null,null,null,null,null,null,null,null,null,null,null,null,null,null,null,null,null,null,null,null,null,null,null,null,null,null,null,null,null,null,null,null,null,null,null,null,null,null,null,null,null,null,null,null,null,null,null,null,null,null,null,null,null,null,null,null,null,null,null,null,null,null,null,null,null,null,null,null,null,null,null,null,null,null,null,null,null,null,null,null,null,null,null,null,null,null,null,null,null,null,null,null,null,null,{"$error":"#VALUE!"},{"$error":"#VALUE!"},{"$error":"#VALUE!"},{"$error":"#VALUE!"},{"$error":"#VALUE!"},{"$f":"IF(ER141=\"\",\"\",_xlfn.NUMBERVALUE(Visualization!$L$20))","v":{"$error":"#VALUE!"}},{"$f":"IF(ER141=\"\",\"\",_xlfn.NUMBERVALUE(Visualization!$L$21))","v":{"$error":"#VALUE!"}},{"$error":"#VALUE!"},{"$f":"IF(EU141=\"\",\"\",IF(Visualization!$F$21=\"\",0,_xlfn.NUMBERVALUE(Visualization!$F$21)))","v":{"$error":"#VALUE!"}},null,null,"#N/A",{"$error":"#VALUE!"},{"$error":"#VALUE!"},"",0,null,{"$error":"#VALUE!"},null,{"$error":"#VALUE!"},null,{"$error":"#VALUE!"}]
[null,null,null,null,null,null,null,null,{"$f":"IF(Values!$D$18=\"\",\"\",6)","v":""},"","","","","",null,5,0.56325999999999998,null,null,null,null,null,null,null,null,null,null,null,null,null,{"$f":"IF(Values!$D$31=\"\",\"\",19)","v":""},"","","","","",null,18,0.30935000000000001,null,null,null,null,null,null,null,null,null,null,null,null,null,null,null,null,null,null,null,null,null,null,null,null,null,null,null,null,null,null,null,null,null,null,null,null,null,null,null,null,null,null,null,null,null,null,null,null,null,null,null,null,null,null,null,null,null,null,null,null,null,null,null,null,null,null,null,null,null,null,null,null,null,null,null,null,null,null,null,null,null,null,null,null,null,null,null,null,null,null,null,null,null,null,null,null,null,null,null,null,null,null,null,null,{"$error":"#VALUE!"},{"$error":"#VALUE!"},{"$error":"#VALUE!"},{"$error":"#VALUE!"},{"$error":"#VALUE!"},{"$f":"IF(ER142=\"\",\"\",_xlfn.NUMBERVALUE(Visualization!$L$20))","v":{"$error":"#VALUE!"}},{"$f":"IF(ER142=\"\",\"\",_xlfn.NUMBERVALUE(Visualization!$L$21))","v":{"$error":"#VALUE!"}},{"$error":"#VALUE!"},{"$f":"IF(EU142=\"\",\"\",IF(Visualization!$F$21=\"\",0,_xlfn.NUMBERVALUE(Visualization!$F$21)))","v":{"$error":"#VALUE!"}},null,null,"#N/A",{"$error":"#VALUE!"},{"$error":"#VALUE!"},"",0,null,{"$error":"#VALUE!"},null,{"$error":"#VALUE!"},null,{"$error":"#VALUE!"}]
[null,null,null,null,null,null,null,null,{"$f":"IF(Values!$D$19=\"\",\"\",7)","v":""},"","","","","",null,6,0.51924999999999999,null,null,null,null,null,null,null,null,null,null,null,null,null,{"$f":"IF(Values!$D$32=\"\",\"\",20)","v":""},"","","","","",null,19,0.30142000000000002,null,null,null,null,null,null,null,null,null,null,null,null,null,null,null,null,null,null,null,null,null,null,null,null,null,null,null,null,null,null,null,null,null,null,null,null,null,null,null,null,null,null,null,null,null,null,null,null,null,null,null,null,null,null,null,null,null,null,null,null,null,null,null,null,null,null,null,null,null,null,null,null,null,null,null,null,null,null,null,null,null,null,null,null,null,null,null,null,null,null,null,null,null,null,null,null,null,null,null,null,null,null,null,null,{"$error":"#VALUE!"},{"$error":"#VALUE!"},{"$error":"#VALUE!"},{"$error":"#VALUE!"},{"$error":"#VALUE!"},{"$f":"IF(ER143=\"\",\"\",_xlfn.NUMBERVALUE(Visualization!$L$20))","v":{"$error":"#VALUE!"}},{"$f":"IF(ER143=\"\",\"\",_xlfn.NUMBERVALUE(Visualization!$L$21))","v":{"$error":"#VALUE!"}},{"$error":"#VALUE!"},{"$f":"IF(EU143=\"\",\"\",IF(Visualization!$F$21=\"\",0,_xlfn.NUMBERVALUE(Visualization!$F$21)))","v":{"$error":"#VALUE!"}},null,null,"#N/A",{"$error":"#VALUE!"},{"$error":"#VALUE!"},"",0,null,{"$error":"#VALUE!"},null,{"$error":"#VALUE!"},null,{"$error":"#VALUE!"}]
[null,null,null,null,null,null,null,null,{"$f":"IF(Values!$D$20=\"\",\"\",8)","v":""},"","","","","",null,7,0.48341000000000001,null,null,null,null,null,null,null,null,null,null,null,null,null,{"$f":"IF(Values!$D$33=\"\",\"\",21)","v":""},"","","","","",null,20,0.29407,null,null,null,null,null,null,null,null,null,null,null,null,null,null,null,null,null,null,null,null,null,null,null,null,null,null,null,null,null,null,null,null,null,null,null,null,null,null,null,null,null,null,null,null,null,null,null,null,null,null,null,null,null,null,null,null,null,null,null,null,null,null,null,null,null,null,null,null,null,null,null,null,null,null,null,null,null,null,null,null,null,null,null,null,null,null,null,null,null,null,null,null,null,null,null,null,null,null,null,null,null,null,null,null,{"$error":"#VALUE!"},{"$error":"#VALUE!"},{"$error":"#VALUE!"},{"$error":"#VALUE!"},{"$error":"#VALUE!"},{"$f":"IF(ER144=\"\",\"\",_xlfn.NUMBERVALUE(Visualization!$L$20))","v":{"$error":"#VALUE!"}},{"$f":"IF(ER144=\"\",\"\",_xlfn.NUMBERVALUE(Visualization!$L$21))","v":{"$error":"#VALUE!"}},{"$error":"#VALUE!"},{"$f":"IF(EU144=\"\",\"\",IF(Visualization!$F$21=\"\",0,_xlfn.NUMBERVALUE(Visualization!$F$21)))","v":{"$error":"#VALUE!"}},null,null,"#N/A",{"$error":"#VALUE!"},{"$error":"#VALUE!"},"",0,null,{"$error":"#VALUE!"},null,{"$error":"#VALUE!"},null,{"$error":"#VALUE!"}]
[null,null,null,null,null,null,null,null,{"$f":"IF(Values!$D$21=\"\",\"\",9)","v":""},"","","","","",null,8,0.45426,null,null,null,null,null,null,null,null,null,null,null,null,null,{"$f":"IF(Values!$D$34=\"\",\"\",22)","v":""},"","","","","",null,21,0.28724,null,null,null,null,null,null,null,null,null,null,null,null,null,null,null,null,null,null,null,null,null,null,null,null,null,null,null,null,null,null,null,null,null,null,null,null,null,null,null,null,null,null,null,null,null,null,null,null,null,null,null,null,null,null,null,null,null,null,null,null,null,null,null,null,null,null,null,null,null,null,null,null,null,null,null,null,null,null,null,null,null,null,null,null,null,null,null,null,null,null,null,null,null,null,null,null,null,null,null,null,null,null,null,null,{"$error":"#VALUE!"},{"$error":"#VALUE!"},{"$error":"#VALUE!"},{"$error":"#VALUE!"},{"$error":"#VALUE!"},{"$f":"IF(ER145=\"\",\"\",_xlfn.NUMBERVALUE(Visualization!$L$20))","v":{"$error":"#VALUE!"}},{"$f":"IF(ER145=\"\",\"\",_xlfn.NUMBERVALUE(Visualization!$L$21))","v":{"$error":"#VALUE!"}},{"$error":"#VALUE!"},{"$f":"IF(EU145=\"\",\"\",IF(Visualization!$F$21=\"\",0,_xlfn.NUMBERVALUE(Visualization!$F$21)))","v":{"$error":"#VALUE!"}},null,null,"#N/A",{"$error":"#VALUE!"},{"$error":"#VALUE!"},"",0,null,{"$error":"#VALUE!"},null,{"$error":"#VALUE!"},null,{"$error":"#VALUE!"}]
[null,null,null,null,null,null,null,null,{"$f":"IF(Values!$D$22=\"\",\"\",10)","v":""},"","","","","",null,9,0.43,null,null,null,null,null,null,null,null,null,null,null,null,null,{"$f":"IF(Values!$D$35=\"\",\"\",23)","v":""},"","","","","",null,22,0.28086,null,null,null,null,null,null,null,null,null,null,null,null,null,null,null,null,null,null,null,null,null,null,null,null,null,null,null,null,null,null,null,null,null,null,null,null,null,null,null,null,null,null,null,null,null,null,null,null,null,null,null,null,null,null,null,null,null,null,null,null,null,null,null,null,null,null,null,null,null,null,null,null,null,null,null,null,null,null,null,null,null,null,null,null,null,null,null,null,null,null,null,null,null,null,null,null,null,null,null,null,null,null,null,null,{"$error":"#VALUE!"},{"$error":"#VALUE!"},{"$error":"#VALUE!"},{"$error":"#VALUE!"},{"$error":"#VALUE!"},{"$f":"IF(ER146=\"\",\"\",_xlfn.NUMBERVALUE(Visualization!$L$20))","v":{"$error":"#VALUE!"}},{"$f":"IF(ER146=\"\",\"\",_xlfn.NUMBERVALUE(Visualization!$L$21))","v":{"$error":"#VALUE!"}},{"$error":"#VALUE!"},{"$f":"IF(EU146=\"\",\"\",IF(Visualization!$F$21=\"\",0,_xlfn.NUMBERVALUE(Visualization!$F$21)))","v":{"$error":"#VALUE!"}},null,null,"#N/A",{"$error":"#VALUE!"},{"$error":"#VALUE!"},"",0,null,{"$error":"#VALUE!"},null,{"$error":"#VALUE!"},null,{"$error":"#VALUE!"}]
[null,null,null,null,null,null,null,null,{"$f":"IF(Values!$D$23=\"\",\"\",11)","v":""},"","","","","",null,10,0.40923999999999999,null,null,null,null,null,null,null,null,null,null,null,null,null,{"$f":"IF(Values!$D$36=\"\",\"\",24)","v":""},"","","","","",null,23,0.27489999999999998,null,null,null,null,null,null,null,null,null,null,null,null,null,null,null,null,null,null,null,null,null,null,null,null,null,null,null,null,null,null,null,null,null,null,null,null,null,null,null,null,null,null,null,null,null,null,null,null,null,null,null,null,null,null,null,null,null,null,null,null,null,null,null,null,null,null,null,null,null,null,null,null,null,null,null,null,null,null,null,null,null,null,null,null,null,null,null,null,null,null,null,null,null,null,null,null,null,null,null,null,null,null,null,null,{"$error":"#VALUE!"},{"$error":"#VALUE!"},{"$error":"#VALUE!"},{"$error":"#VALUE!"},{"$error":"#VALUE!"},{"$f":"IF(ER147=\"\",\"\",_xlfn.NUMBERVALUE(Visualization!$L$20))","v":{"$error":"#VALUE!"}},{"$f":"IF(ER147=\"\",\"\",_xlfn.NUMBERVALUE(Visualization!$L$21))","v":{"$error":"#VALUE!"}},{"$error":"#VALUE!"},{"$f":"IF(EU147=\"\",\"\",IF(Visualization!$F$21=\"\",0,_xlfn.NUMBERVALUE(Visualization!$F$21)))","v":{"$error":"#VALUE!"}},null,null,"#N/A",{"$error":"#VALUE!"},{"$error":"#VALUE!"},"",0,null,{"$error":"#VALUE!"},null,{"$error":"#VALUE!"},null,{"$error":"#VALUE!"}]
[null,null,null,null,null,null,null,null,{"$f":"IF(Values!$D$24=\"\",\"\",12)","v":""},"","","","","",null,11,0.39121,null,null,null,null,null,null,null,null,null,null,null,null,null,{"$f":"IF(Values!$D$37=\"\",\"\",25)","v":""},"","","","","",null,24,0.26929999999999998,null,null,null,null,null,null,null,null,null,null,null,null,null,null,null,null,null,null,null,null,null,null,null,null,null,null,null,null,null,null,null,null,null,null,null,null,null,null,null,null,null,null,null,null,null,null,null,null,null,null,null,null,null,null,null,null,null,null,null,null,null,null,null,null,null,null,null,null,null,null,null,null,null,null,null,null,null,null,null,null,null,null,null,null,null,null,null,null,null,null,null,null,null,null,null,null,null,null,null,null,null,null,null,null,{"$error":"#VALUE!"},{"$error":"#VALUE!"},{"$error":"#VALUE!"},{"$error":"#VALUE!"},{"$error":"#VALUE!"},{"$f":"IF(ER148=\"\",\"\",_xlfn.NUMBERVALUE(Visualization!$L$20))","v":{"$error":"#VALUE!"}},{"$f":"IF(ER148=\"\",\"\",_xlfn.NUMBERVALUE(Visualization!$L$21))","v":{"$error":"#VALUE!"}},{"$error":"#VALUE!"},{"$f":"IF(EU148=\"\",\"\",IF(Visualization!$F$21=\"\",0,_xlfn.NUMBERVALUE(Visualization!$F$21)))","v":{"$error":"#VALUE!"}},null,null,"#N/A",{"$error":"#VALUE!"},{"$error":"#VALUE!"},"",0,null,{"$error":"#VALUE!"},null,{"$error":"#VALUE!"},null,{"$error":"#VALUE!"}]
[null,null,null,null,null,null,null,null,{"$f":"IF(Values!$D$25=\"\",\"\",13)","v":""},"","","","","",null,12,0.37541999999999998,null,null,null,null,null,null,null,null,null,null,null,null,null,{"$f":"IF(Values!$D$38=\"\",\"\",26)","v":""},"","","","","",null,25,0.26404,null,null,null,null,null,null,null,null,null,null,null,null,null,null,null,null,null,null,null,null,null,null,null,null,null,null,null,null,null,null,null,null,null,null,null,null,null,null,null,null,null,null,null,null,null,null,null,null,null,null,null,null,null,null,null,null,null,null,null,null,null,null,null,null,null,null,null,null,null,null,null,null,null,null,null,null,null,null,null,null,null,null,null,null,null,null,null,null,null,null,null,null,null,null,null,null,null,null,null,null,null,null,null,null,{"$error":"#VALUE!"},{"$error":"#VALUE!"},{"$error":"#VALUE!"},{"$error":"#VALUE!"},{"$error":"#VALUE!"},{"$f":"IF(ER149=\"\",\"\",_xlfn.NUMBERVALUE(Visualization!$L$20))","v":{"$error":"#VALUE!"}},{"$f":"IF(ER149=\"\",\"\",_xlfn.NUMBERVALUE(Visualization!$L$21))","v":{"$error":"#VALUE!"}},{"$error":"#VALUE!"},{"$f":"IF(EU149=\"\",\"\",IF(Visualization!$F$21=\"\",0,_xlfn.NUMBERVALUE(Visualization!$F$21)))","v":{"$error":"#VALUE!"}},null,null,"#N/A",{"$error":"#VALUE!"},{"$error":"#VALUE!"},"",0,null,{"$error":"#VALUE!"},null,{"$error":"#VALUE!"},null,{"$error":"#VALUE!"}]
[null,null,null,null,null,null,null,null,{"$f":"IF(Values!$D$26=\"\",\"\",14)","v":""},"","","","","",null,13,0.36142000000000002,null,null,null,null,null,null,null,null,null,null,null,null,null,{"$f":"IF(Values!$D$39=\"\",\"\",27)","v":""},"","","","","",null,26,0.25907000000000002,null,null,null,null,null,null,null,null,null,null,null,null,null,null,null,null,null,null,null,null,null,null,null,null,null,null,null,null,null,null,null,null,null,null,null,null,null,null,null,null,null,null,null,null,null,null,null,null,null,null,null,null,null,null,null,null,null,null,null,null,null,null,null,null,null,null,null,null,null,null,null,null,null,null,null,null,null,null,null,null,null,null,null,null,null,null,null,null,null,null,null,null,null,null,null,null,null,null,null,null,null,null,null,null,{"$error":"#VALUE!"},{"$error":"#VALUE!"},{"$error":"#VALUE!"},{"$error":"#VALUE!"},{"$error":"#VALUE!"},{"$f":"IF(ER150=\"\",\"\",_xlfn.NUMBERVALUE(Visualization!$L$20))","v":{"$error":"#VALUE!"}},{"$f":"IF(ER150=\"\",\"\",_xlfn.NUMBERVALUE(Visualization!$L$21))","v":{"$error":"#VALUE!"}},{"$error":"#VALUE!"},{"$f":"IF(EU150=\"\",\"\",IF(Visualization!$F$21=\"\",0,_xlfn.NUMBERVALUE(Visualization!$F$21)))","v":{"$error":"#VALUE!"}},null,null,"#N/A",{"$error":"#VALUE!"},{"$error":"#VALUE!"},"",0,null,{"$error":"#VALUE!"},null,{"$error":"#VALUE!"},null,{"$error":"#VALUE!"}]
[null,null,null,null,null,null,null,null,{"$f":"IF(Values!$D$27=\"\",\"\",15)","v":""},"","","","","",null,14,0.34888999999999998,null,null,null,null,null,null,null,null,null,null,null,null,null,{"$f":"IF(Values!$D$40=\"\",\"\",28)","v":""},"","","","","",null,27,0.25436999999999999,null,null,null,null,null,null,null,null,null,null,null,null,null,null,null,null,null,null,null,null,null,null,null,null,null,null,null,null,null,null,null,null,null,null,null,null,null,null,null,null,null,null,null,null,null,null,null,null,null,null,null,null,null,null,null,null,null,null,null,null,null,null,null,null,null,null,null,null,null,null,null,null,null,null,null,null,null,null,null,null,null,null,null,null,null,null,null,null,null,null,null,null,null,null,null,null,null,null,null,null,null,null,null,null,{"$error":"#VALUE!"},{"$error":"#VALUE!"},{"$error":"#VALUE!"},{"$error":"#VALUE!"},{"$error":"#VALUE!"},{"$f":"IF(ER151=\"\",\"\",_xlfn.NUMBERVALUE(Visualization!$L$20))","v":{"$error":"#VALUE!"}},{"$f":"IF(ER151=\"\",\"\",_xlfn.NUMBERVALUE(Visualization!$L$21))","v":{"$error":"#VALUE!"}},{"$error":"#VALUE!"},{"$f":"IF(EU151=\"\",\"\",IF(Visualization!$F$21=\"\",0,_xlfn.NUMBERVALUE(Visualization!$F$21)))","v":{"$error":"#VALUE!"}},null,null,"#N/A",{"$error":"#VALUE!"},{"$error":"#VALUE!"},"",0,null,{"$error":"#VALUE!"},null,{"$error":"#VALUE!"},null,{"$error":"#VALUE!"}]
[null,null,null,null,null,null,null,null,{"$f":"IF(Values!$D$28=\"\",\"\",16)","v":""},"","","","","",null,15,0.33759,null,null,null,null,null,null,null,null,null,null,null,null,null,{"$f":"IF(Values!$D$41=\"\",\"\",29)","v":""},"","","","","",null,28,0.24993000000000001,null,null,null,null,null,null,null,null,null,null,null,null,null,null,null,null,null,null,null,null,null,null,null,null,null,null,null,null,null,null,null,null,null,null,null,null,null,null,null,null,null,null,null,null,null,null,null,null,null,null,null,null,null,null,null,null,null,null,null,null,null,null,null,null,null,null,null,null,null,null,null,null,null,null,null,null,null,null,null,null,null,null,null,null,null,null,null,null,null,null,null,null,null,null,null,null,null,null,null,null,null,null,null,null,{"$error":"#VALUE!"},{"$error":"#VALUE!"},{"$error":"#VALUE!"},{"$error":"#VALUE!"},{"$error":"#VALUE!"},{"$f":"IF(ER152=\"\",\"\",_xlfn.NUMBERVALUE(Visualization!$L$20))","v":{"$error":"#VALUE!"}},{"$f":"IF(ER152=\"\",\"\",_xlfn.NUMBERVALUE(Visualization!$L$21))","v":{"$error":"#VALUE!"}},{"$error":"#VALUE!"},{"$f":"IF(EU152=\"\",\"\",IF(Visualization!$F$21=\"\",0,_xlfn.NUMBERVALUE(Visualization!$F$21)))","v":{"$error":"#VALUE!"}},null,null,"#N/A",{"$error":"#VALUE!"},{"$error":"#VALUE!"},"",0,null,{"$error":"#VALUE!"},null,{"$error":"#VALUE!"},null,{"$error":"#VALUE!"}]
[null,null,null,null,null,null,null,null,{"$f":"IF(Values!$D$29=\"\",\"\",17)","v":""},"","","","","",null,16,0.32733000000000001,null,null,null,null,null,null,null,null,null,null,null,null,null,{"$f":"IF(Values!$D$42=\"\",\"\",30)","v":""},"","","","","",null,29,0.24571000000000001,null,null,null,null,null,null,null,null,null,null,null,null,null,null,null,null,null,null,null,null,null,null,null,null,null,null,null,null,null,null,null,null,null,null,null,null,null,null,null,null,null,null,null,null,null,null,null,null,null,null,null,null,null,null,null,null,null,null,null,null,null,null,null,null,null,null,null,null,null,null,null,null,null,null,null,null,null,null,null,null,null,null,null,null,null,null,null,null,null,null,null,null,null,null,null,null,null,null,null,null,null,null,null,null,{"$error":"#VALUE!"},{"$error":"#VALUE!"},{"$error":"#VALUE!"},{"$error":"#VALUE!"},{"$error":"#VALUE!"},{"$f":"IF(ER153=\"\",\"\",_xlfn.NUMBERVALUE(Visualization!$L$20))","v":{"$error":"#VALUE!"}},{"$f":"IF(ER153=\"\",\"\",_xlfn.NUMBERVALUE(Visualization!$L$21))","v":{"$error":"#VALUE!"}},{"$error":"#VALUE!"},{"$f":"IF(EU153=\"\",\"\",IF(Visualization!$F$21=\"\",0,_xlfn.NUMBERVALUE(Visualization!$F$21)))","v":{"$error":"#VALUE!"}},null,null,"#N/A",{"$error":"#VALUE!"},{"$error":"#VALUE!"},"",0,null,{"$error":"#VALUE!"},null,{"$error":"#VALUE!"},null,{"$error":"#VALUE!"}]
[null,null,null,null,null,null,null,null,{"$f":"IF(Values!$D$30=\"\",\"\",18)","v":""},"","","","","",null,17,0.31796000000000002,null,null,null,null,null,null,null,null,null,null,null,null,null,{"$f":"IF(Values!$D$43=\"\",\"\",31)","v":""},"","","","","",null,30,0.2417,null,null,null,null,null,null,null,null,null,null,null,null,null,null,null,null,null,null,null,null,null,null,null,null,null,null,null,null,null,null,null,null,null,null,null,null,null,null,null,null,null,null,null,null,null,null,null,null,null,null,null,null,null,null,null,null,null,null,null,null,null,null,null,null,null,null,null,null,null,null,null,null,null,null,null,null,null,null,null,null,null,null,null,null,null,null,null,null,null,null,null,null,null,null,null,null,null,null,null,null,null,null,null,null,{"$error":"#VALUE!"},{"$error":"#VALUE!"},{"$error":"#VALUE!"},{"$error":"#VALUE!"},{"$error":"#VALUE!"},{"$f":"IF(ER154=\"\",\"\",_xlfn.NUMBERVALUE(Visualization!$L$20))","v":{"$error":"#VALUE!"}},{"$f":"IF(ER154=\"\",\"\",_xlfn.NUMBERVALUE(Visualization!$L$21))","v":{"$error":"#VALUE!"}},{"$error":"#VALUE!"},{"$f":"IF(EU154=\"\",\"\",IF(Visualization!$F$21=\"\",0,_xlfn.NUMBERVALUE(Visualization!$F$21)))","v":{"$error":"#VALUE!"}},null,null,"#N/A",{"$error":"#VALUE!"},{"$error":"#VALUE!"},"",0,null,{"$error":"#VALUE!"},null,{"$error":"#VALUE!"},null,{"$error":"#VALUE!"}]
[null,null,null,null,null,null,null,null,{"$f":"IF(Values!$D$31=\"\",\"\",19)","v":""},"","","","","",null,18,0.30935000000000001,null,null,null,null,null,null,null,null,null,null,null,null,null,{"$f":"IF(Values!$D$44=\"\",\"\",32)","v":""},"","","","","",null,31,0.23788000000000001,null,null,null,null,null,null,null,null,null,null,null,null,null,null,null,null,null,null,null,null,null,null,null,null,null,null,null,null,null,null,null,null,null,null,null,null,null,null,null,null,null,null,null,null,null,null,null,null,null,null,null,null,null,null,null,null,null,null,null,null,null,null,null,null,null,null,null,null,null,null,null,null,null,null,null,null,null,null,null,null,null,null,null,null,null,null,null,null,null,null,null,null,null,null,null,null,null,null,null,null,null,null,null,null,{"$error":"#VALUE!"},{"$error":"#VALUE!"},{"$error":"#VALUE!"},{"$error":"#VALUE!"},{"$error":"#VALUE!"},{"$f":"IF(ER155=\"\",\"\",_xlfn.NUMBERVALUE(Visualization!$L$20))","v":{"$error":"#VALUE!"}},{"$f":"IF(ER155=\"\",\"\",_xlfn.NUMBERVALUE(Visualization!$L$21))","v":{"$error":"#VALUE!"}},{"$error":"#VALUE!"},{"$f":"IF(EU155=\"\",\"\",IF(Visualization!$F$21=\"\",0,_xlfn.NUMBERVALUE(Visualization!$F$21)))","v":{"$error":"#VALUE!"}},null,null,"#N/A",{"$error":"#VALUE!"},{"$error":"#VALUE!"},"",0,null,{"$error":"#VALUE!"},null,{"$error":"#VALUE!"},null,{"$error":"#VALUE!"}]
[null,null,null,null,null,null,null,null,{"$f":"IF(Values!$D$32=\"\",\"\",20)","v":""},"","","","","",null,19,0.30142000000000002,null,null,null,null,null,null,null,null,null,null,null,null,null,{"$f":"IF(Values!$D$45=\"\",\"\",33)","v":""},{"$f":"DB40","v":""},{"$f":"IF(AE156=\"\",\"\",LARGE($AF$124:$AF$173,AE156))","v":""},{"$f":"IF(AE156=\"\",\"\",(AE156-1)/COUNT($AE$124:$AE$173))","v":""},{"$f":"IF(AG156=\"\",\"\",_xlfn.NORM.DIST(AG156,$CI$6,$EF$14,1))","v":""},"",null,32,0.23424,null,null,null,null,null,null,null,null,null,null,null,null,null,null,null,null,null,null,null,null,null,null,null,null,null,null,null,null,null,null,null,null,null,null,null,null,null,null,null,null,null,null,null,null,null,null,null,null,null,null,null,null,null,null,null,null,null,null,null,null,null,null,null,null,null,null,null,null,null,null,null,null,null,null,null,null,null,null,null,null,null,null,null,null,null,null,null,null,null,null,null,null,null,null,null,null,null,null,null,null,null,null,null,null,{"$error":"#VALUE!"},{"$error":"#VALUE!"},{"$error":"#VALUE!"},{"$error":"#VALUE!"},{"$error":"#VALUE!"},{"$f":"IF(ER156=\"\",\"\",_xlfn.NUMBERVALUE(Visualization!$L$20))","v":{"$error":"#VALUE!"}},{"$f":"IF(ER156=\"\",\"\",_xlfn.NUMBERVALUE(Visualization!$L$21))","v":{"$error":"#VALUE!"}},{"$error":"#VALUE!"},{"$f":"IF(EU156=\"\",\"\",IF(Visualization!$F$21=\"\",0,_xlfn.NUMBERVALUE(Visualization!$F$21)))","v":{"$error":"#VALUE!"}},null,null,"#N/A",{"$error":"#VALUE!"},{"$error":"#VALUE!"},"",0,null,{"$error":"#VALUE!"},null,{"$error":"#VALUE!"},null,{"$error":"#VALUE!"}]
[null,null,null,null,null,null,null,null,{"$f":"IF(Values!$D$33=\"\",\"\",21)","v":""},"","","","","",null,20,0.29407,null,null,null,null,null,null,null,null,null,null,null,null,null,{"$f":"IF(Values!$D$46=\"\",\"\",34)","v":""},"","","","","",null,33,0.23075999999999999,null,null,null,null,null,null,null,null,null,null,null,null,null,null,null,null,null,null,null,null,null,null,null,null,null,null,null,null,null,null,null,null,null,null,null,null,null,null,null,null,null,null,null,null,null,null,null,null,null,null,null,null,null,null,null,null,null,null,null,null,null,null,null,null,null,null,null,null,null,null,null,null,null,null,null,null,null,null,null,null,null,null,null,null,null,null,null,null,null,null,null,null,null,null,null,null,null,null,null,null,null,null,null,null,{"$error":"#VALUE!"},{"$error":"#VALUE!"},{"$error":"#VALUE!"},{"$error":"#VALUE!"},{"$error":"#VALUE!"},{"$f":"IF(ER157=\"\",\"\",_xlfn.NUMBERVALUE(Visualization!$L$20))","v":{"$error":"#VALUE!"}},{"$f":"IF(ER157=\"\",\"\",_xlfn.NUMBERVALUE(Visualization!$L$21))","v":{"$error":"#VALUE!"}},{"$error":"#VALUE!"},{"$f":"IF(EU157=\"\",\"\",IF(Visualization!$F$21=\"\",0,_xlfn.NUMBERVALUE(Visualization!$F$21)))","v":{"$error":"#VALUE!"}},null,null,"#N/A",{"$error":"#VALUE!"},{"$error":"#VALUE!"},"",0,null,{"$error":"#VALUE!"},null,{"$error":"#VALUE!"},null,{"$error":"#VALUE!"}]
[null,null,null,null,null,null,null,null,{"$f":"IF(Values!$D$34=\"\",\"\",22)","v":""},"","","","","",null,21,0.28724,null,null,null,null,null,null,null,null,null,null,null,null,null,{"$f":"IF(Values!$D$47=\"\",\"\",35)","v":""},"","","","","",null,34,0.22742999999999999,null,null,null,null,null,null,null,null,null,null,null,null,null,null,null,null,null,null,null,null,null,null,null,null,null,null,null,null,null,null,null,null,null,null,null,null,null,null,null,null,null,null,null,null,null,null,null,null,null,null,null,null,null,null,null,null,null,null,null,null,null,null,null,null,null,null,null,null,null,null,null,null,null,null,null,null,null,null,null,null,null,null,null,null,null,null,null,null,null,null,null,null,null,null,null,null,null,null,null,null,null,null,null,null,{"$error":"#VALUE!"},{"$error":"#VALUE!"},{"$error":"#VALUE!"},{"$error":"#VALUE!"},{"$error":"#VALUE!"},{"$f":"IF(ER158=\"\",\"\",_xlfn.NUMBERVALUE(Visualization!$L$20))","v":{"$error":"#VALUE!"}},{"$f":"IF(ER158=\"\",\"\",_xlfn.NUMBERVALUE(Visualization!$L$21))","v":{"$error":"#VALUE!"}},{"$error":"#VALUE!"},{"$f":"IF(EU158=\"\",\"\",IF(Visualization!$F$21=\"\",0,_xlfn.NUMBERVALUE(Visualization!$F$21)))","v":{"$error":"#VALUE!"}},null,null,"#N/A",{"$error":"#VALUE!"},{"$error":"#VALUE!"},"",0,null,{"$error":"#VALUE!"},null,{"$error":"#VALUE!"},null,{"$error":"#VALUE!"}]
[null,null,null,null,null,null,null,null,{"$f":"IF(Values!$D$35=\"\",\"\",23)","v":""},"","","","","",null,22,0.28086,null,null,null,null,null,null,null,null,null,null,null,null,null,{"$f":"IF(Values!$D$48=\"\",\"\",36)","v":""},"","","","","",null,35,0.22423999999999999]
[null,null,null,null,null,null,null,null,{"$f":"IF(Values!$D$36=\"\",\"\",24)","v":""},"","","","","",null,23,0.27489999999999998,null,null,null,null,null,null,null,null,null,null,null,null,null,{"$f":"IF(Values!$D$49=\"\",\"\",37)","v":""},"","","","",""]
[null,null,null,null,null,null,null,null,{"$f":"IF(Values!$D$37=\"\",\"\",25)","v":""},"","","","","",null,24,0.26929999999999998,null,null,null,null,null,null,null,null,null,null,null,null,null,{"$f":"IF(Values!$D$50=\"\",\"\",38)","v":""},"","","","",""]
[null,null,null,null,null,null,null,null,{"$f":"IF(Values!$D$38=\"\",\"\",26)","v":""},"","","","","",null,25,0.26404,null,null,null,null,null,null,null,null,null,null,null,null,null,{"$f":"IF(Values!$D$51=\"\",\"\",39)","v":""},"","","","",{"$f":"IF(AH162=\"\",\"\",ABS(AH162-AI162))","v":""},null,"Test value AD: "]
[null,null,null,null,null,null,null,null,{"$f":"IF(Values!$D$39=\"\",\"\",27)","v":""},"","","","","",null,26,0.25907000000000002,null,null,null,null,null,null,null,null,null,null,null,null,null,{"$f":"IF(Values!$D$52=\"\",\"\",40)","v":""},"","","","","",null,{"$f":"IF(AF124=\"\",\"\",MAX(AJ124:AJ173))","v":""}]
[null,null,null,null,null,null,null,null,{"$f":"IF(Values!$D$40=\"\",\"\",28)","v":""},"","","","","",null,27,0.25436999999999999,null,null,null,null,null,null,null,null,null,null,null,null,null,{"$f":"IF(Values!$D$53=\"\",\"\",41)","v":""},"","","","",""]
[null,null,null,null,null,null,null,null,{"$f":"IF(Values!$D$41=\"\",\"\",29)","v":""},"","","","","",null,28,0.24993000000000001,null,null,null,null,null,null,null,null,null,null,null,null,null,{"$f":"IF(Values!$D$54=\"\",\"\",42)","v":""},"","","","",""]
[null,null,null,null,null,null,null,null,{"$f":"IF(Values!$D$42=\"\",\"\",30)","v":""},"","","","","",null,29,0.24571000000000001,null,null,null,null,null,null,null,null,null,null,null,null,null,{"$f":"IF(Values!$D$55=\"\",\"\",43)","v":""},"","","","",""]
[null,null,null,null,null,null,null,null,{"$f":"IF(Values!$D$43=\"\",\"\",31)","v":""},"","","","","",null,30,0.2417,null,null,null,null,null,null,null,null,null,null,null,null,null,{"$f":"IF(Values!$D$56=\"\",\"\",44)","v":""},"","","","","",null,"Threshold SW [95%]:"]
[null,null,null,null,null,null,null,null,{"$f":"IF(Values!$D$44=\"\",\"\",32)","v":""},"","","","","",null,31,0.23788000000000001,null,null,null,null,null,null,null,null,null,null,null,null,null,{"$f":"IF(Values!$D$57=\"\",\"\",45)","v":""},"","","","","",null,{"$f":"IF(AL163=\"\",\"\",VLOOKUP(COUNT(AF124:AF173),AL125:AM159,2))","v":""}]
[null,null,null,null,null,null,null,null,{"$f":"IF(Values!$D$45=\"\",\"\",33)","v":""},{"$f":"DA40","v":""},{"$f":"IF(I169=\"\",\"\",LARGE($J$137:$J$186,I169))","v":""},{"$f":"IF(I169=\"\",\"\",(I169-1)/COUNT($I$137:$I$186))","v":""},{"$f":"IF(K169=\"\",\"\",_xlfn.NORM.DIST(K169,$BQ$6,$DW$14,1))","v":""},"",null,32,0.23424,null,null,null,null,null,null,null,null,null,null,null,null,null,{"$f":"IF(Values!$D$58=\"\",\"\",46)","v":""},"","","","",""]
[null,null,null,null,null,null,null,null,{"$f":"IF(Values!$D$46=\"\",\"\",34)","v":""},"","","","","",null,33,0.23075999999999999,null,null,null,null,null,null,null,null,null,null,null,null,null,{"$f":"IF(Values!$D$59=\"\",\"\",47)","v":""},"","","","",""]
[null,null,null,null,null,null,null,null,{"$f":"IF(Values!$D$47=\"\",\"\",35)","v":""},"","","","","",null,34,0.22742999999999999,null,null,null,null,null,null,null,null,null,null,null,null,null,{"$f":"IF(Values!$D$60=\"\",\"\",48)","v":""},"","","","",""]
[null,null,null,null,null,null,null,null,{"$f":"IF(Values!$D$48=\"\",\"\",36)","v":""},"","","","","",null,35,0.22423999999999999,null,null,null,null,null,null,null,null,null,null,null,null,null,{"$f":"IF(Values!$D$61=\"\",\"\",49)","v":""},"","","","",""]
[null,null,null,null,null,null,null,null,{"$f":"IF(Values!$D$49=\"\",\"\",37)","v":""},"","","","","",null,null,null,null,null,null,null,null,null,null,null,null,null,null,null,null,{"$f":"IF(Values!$D$62=\"\",\"\",50)","v":""},"","","","","",null,"H1 = True If AD > SW"]
[null,null,null,null,null,null,null,null,{"$f":"IF(Values!$D$50=\"\",\"\",38)","v":""},"","","","","",null,null,null,null,null,null,null,null,null,null,null,null,null,null,null,null,null,null,null,null,null,null,null,"H0 = True If AD < SW"]
[null,null,null,null,null,null,null,null,{"$f":"IF(Values!$D$51=\"\",\"\",39)","v":""},"","","","","",null,"Test value AD: "]
[null,null,null,null,null,null,null,null,{"$f":"IF(Values!$D$52=\"\",\"\",40)","v":""},"","","","","",null,{"$f":"IF(J137=\"\",\"\",MAX(N137:N186))","v":""}]
[null,null,null,null,null,null,null,null,{"$f":"IF(Values!$D$53=\"\",\"\",41)","v":""},"","","","","",null,null,null,null,null,null,null,null,null,null,null,null,null,null,null,null,null,null,null,null,null,null,"H1: Values are normal ditributed"]
[null,null,null,null,null,null,null,null,{"$f":"IF(Values!$D$54=\"\",\"\",42)","v":""},"","","","","",null,null,null,null,null,null,null,null,null,null,null,null,null,null,null,null,null,null,null,null,null,null,"H0: Values are not normal distributed"]
[null,null,null,null,null,null,null,null,{"$f":"IF(Values!$D$55=\"\",\"\",43)","v":""},"","","","",""]
[null,null,null,null,null,null,null,null,{"$f":"IF(Values!$D$56=\"\",\"\",44)","v":""},"","","","","",null,"Threshold SW [95%]:"]
[null,null,null,null,null,null,null,null,{"$f":"IF(Values!$D$57=\"\",\"\",45)","v":""},"","","","","",null,{"$f":"IF(P176=\"\",\"\",VLOOKUP(COUNT(J137:J186),P138:Q172,2))","v":""}]
[null,null,null,null,null,null,null,null,{"$f":"IF(Values!$D$58=\"\",\"\",46)","v":""},"","","","",""]
[null,null,null,null,null,null,null,null,{"$f":"IF(Values!$D$59=\"\",\"\",47)","v":""},"","","","","",null,null,null,null,null,null,null,null,null,null,null,null,null,null,null,null,"Nr.","Value","Values (sorted according smallest)","Values (sorted according biggest)","n (i)","n (b)",null,"Threshold"]
[null,null,null,null,null,null,null,null,{"$f":"IF(Values!$D$60=\"\",\"\",48)","v":""},"","","","",""]
[null,null,null,null,null,null,null,null,{"$f":"IF(Values!$D$61=\"\",\"\",49)","v":""},"","","","","",null,null,null,null,null,null,null,null,null,null,null,null,null,null,null,null,{"$f":"IF(Values!$D$13=\"\",\"\",1)","v":""},{"$f":"DB8","v":""},{"$f":"IF(AF185=\"\",\"\",SMALL($AF$185:$AF$234,AE185))","v":""},{"$f":"IF(AF185=\"\",\"\",LARGE($AF$185:$AF$234,AE185))","v":""},{"$f":"IF(AE185=\"\",\"\",IF(HLOOKUP(IF(ISEVEN(COUNT($AE$185:$AE$234)),COUNT($AE$185:$AE$234),COUNT($AE$185:$AE$234)-1),$J$254:$AK$279,AE185+1,2)=0,\"\",HLOOKUP(IF(ISEVEN(COUNT($AE$185:$AE$234)),COUNT($AE$185:$AE$234),COUNT($AE$185:$AE$234)-1),$J$254:$AK$279,AE185+1,2)))","v":""},{"$f":"IF(AI185=\"\",\"\",AI185*(AH185-AG185))","v":""},null,"n",0.95]
[null,null,null,null,null,null,null,null,{"$f":"IF(Values!$D$62=\"\",\"\",50)","v":""},"","","","","",null,"H1 = True If AD > SW",null,null,null,null,null,null,null,null,null,null,null,null,null,null,{"$f":"IF(Values!$D$14=\"\",\"\",2)","v":""},"","","","",{"$f":"IF(AI186=\"\",\"\",AI186*(AH186-AG186))","v":""},null,3,0.76700000000000002]
[null,null,null,null,null,null,null,null,null,null,null,null,null,null,null,"H0 = True If AD < SW",null,null,null,null,null,null,null,null,null,null,null,null,null,null,{"$f":"IF(Values!$D$15=\"\",\"\",3)","v":""},"","","","","",null,4,0.748]
[null,null,null,null,null,null,null,null,null,null,null,null,null,null,null,null,null,null,null,null,null,null,null,null,null,null,null,null,null,null,{"$f":"IF(Values!$D$16=\"\",\"\",4)","v":""},"","","","","",null,5,0.76200000000000001]
[null,null,null,null,null,null,null,null,null,null,null,null,null,null,null,null,null,null,null,null,null,null,null,null,null,null,null,null,null,null,{"$f":"IF(Values!$D$17=\"\",\"\",5)","v":""},"","","","","",null,6,0.78800000000000003]
[null,null,null,null,null,null,null,null,null,null,null,null,null,null,"H1: Values are normal ditributed",null,null,null,null,null,null,null,null,null,null,null,null,null,null,null,{"$f":"IF(Values!$D$18=\"\",\"\",6)","v":""},"","","","","",null,7,0.8]
[null,null,null,null,null,null,null,null,null,null,null,null,null,null,"H0: Values are not normal distributed",null,null,null,null,null,null,null,null,null,null,null,null,null,null,null,{"$f":"IF(Values!$D$19=\"\",\"\",7)","v":""},"","","","","",null,8,0.81799999999999995]
[null,null,null,null,null,null,null,null,null,null,null,null,null,null,null,null,null,null,null,null,null,null,null,null,null,null,null,null,null,null,{"$f":"IF(Values!$D$20=\"\",\"\",8)","v":""},"","","","","",null,9,0.82899999999999996]
[null,null,null,null,null,null,null,null,null,null,null,null,null,null,null,null,null,null,null,null,null,null,null,null,null,null,null,null,null,null,{"$f":"IF(Values!$D$21=\"\",\"\",9)","v":""},"","","","","",null,10,0.84199999999999997]
[null,null,null,null,null,null,null,null,null,null,null,null,null,null,null,null,null,null,null,null,null,null,null,null,null,null,null,null,null,null,{"$f":"IF(Values!$D$22=\"\",\"\",10)","v":""},"","","","","",null,12,0.85899999999999999]
[null,null,null,null,null,null,null,null,null,null,null,null,null,null,null,null,null,null,null,null,null,null,null,null,null,null,null,null,null,null,{"$f":"IF(Values!$D$23=\"\",\"\",11)","v":""},"","","","",""," ",14,0.874]
[null,null,null,null,null,null,null,null,"Nr.","Value","Values (sorted according smallest)","Values (sorted according biggest)","n (i)","n (b)",null,"Threshold",null,null,null,null,null,null,null,null,null,null,null,null,null,null,{"$f":"IF(Values!$D$24=\"\",\"\",12)","v":""},"","","","","",null,16,0.88700000000000001]
[null,null,null,null,null,null,null,null,null,null,null,null,null,null,null,null,null,null,null,null,null,null,null,null,null,null,null,null,null,null,{"$f":"IF(Values!$D$25=\"\",\"\",13)","v":""},"","","","","",null,18,0.89700000000000002]
[null,null,null,null,null,null,null,null,{"$f":"IF(Values!$D$13=\"\",\"\",1)","v":""},{"$f":"IF(DA8=\"\",\"\",DA8)","v":""},{"$f":"IF(J198=\"\",\"\",SMALL($J$198:$J$247,I198))","v":""},{"$f":"IF(J198=\"\",\"\",LARGE($J$198:$J$247,I198))","v":""},{"$f":"IF(I198=\"\",\"\",IF(HLOOKUP(IF(ISEVEN(COUNT($I$198:$I$247)),COUNT($I$198:$I$247),COUNT($I$198:$I$247)-1),$J$254:$AK$279,I198+1,2)=0,\"\",HLOOKUP(IF(ISEVEN(COUNT($I$198:$I$247)),COUNT($I$198:$I$247),COUNT($I$198:$I$247)-1),$J$254:$AK$279,I198+1,2)))","v":""},{"$f":"IF(M198=\"\",\"\",M198*(L198-K198))","v":""},null,"n",0.95,null,null,null,null,null,null,null,null,null,null,null,null,null,{"$f":"IF(Values!$D$26=\"\",\"\",14)","v":""},"","","","","",null,20,0.90500000000000003]
[null,null,null,null,null,null,null,null,{"$f":"IF(Values!$D$14=\"\",\"\",2)","v":""},"","","","",{"$f":"IF(M199=\"\",\"\",M199*(L199-K199))","v":""},null,3,0.76700000000000002,null,null,null,null,null,null,null,null,null,null,null,null,null,{"$f":"IF(Values!$D$27=\"\",\"\",15)","v":""},"","","","","",null,21,0.90800000000000003]
[null,null,null,null,null,null,null,null,{"$f":"IF(Values!$D$15=\"\",\"\",3)","v":""},"","","","","",null,4,0.748,null,null,null,null,null,null,null,null,null,null,null,null,null,{"$f":"IF(Values!$D$28=\"\",\"\",16)","v":""},"","","","","",null,22,0.91100000000000003]
[null,null,null,null,null,null,null,null,{"$f":"IF(Values!$D$16=\"\",\"\",4)","v":""},"","","","","",null,5,0.76200000000000001,null,null,null,null,null,null,null,null,null,null,null,null,null,{"$f":"IF(Values!$D$29=\"\",\"\",17)","v":""},"","","","","",null,23,0.91400000000000003]
[null,null,null,null,null,null,null,null,{"$f":"IF(Values!$D$17=\"\",\"\",5)","v":""},"","","","","",null,6,0.78800000000000003,null,null,null,null,null,null,null,null,null,null,null,null,null,{"$f":"IF(Values!$D$30=\"\",\"\",18)","v":""},"","","","","",null,24,0.91600000000000004]
[null,null,null,null,null,null,null,null,{"$f":"IF(Values!$D$18=\"\",\"\",6)","v":""},"","","","","",null,7,0.8,null,null,null,null,null,null,null,null,null,null,null,null,null,{"$f":"IF(Values!$D$31=\"\",\"\",19)","v":""},"","","","","",null,25,0.91800000000000004]
[null,null,null,null,null,null,null,null,{"$f":"IF(Values!$D$19=\"\",\"\",7)","v":""},"","","","","",null,8,0.81799999999999995,null,null,null,null,null,null,null,null,null,null,null,null,null,{"$f":"IF(Values!$D$32=\"\",\"\",20)","v":""},"","","","","",null,26,0.92]
[null,null,null,null,null,null,null,null,{"$f":"IF(Values!$D$20=\"\",\"\",8)","v":""},"","","","","",null,9,0.82899999999999996,null,null,null,null,null,null,null,null,null,null,null,null,null,{"$f":"IF(Values!$D$33=\"\",\"\",21)","v":""},"","","","","",null,27,0.92300000000000004]
[null,null,null,null,null,null,null,null,{"$f":"IF(Values!$D$21=\"\",\"\",9)","v":""},"","","","","",null,10,0.84199999999999997,null,null,null,null,null,null,null,null,null,null,null,null,null,{"$f":"IF(Values!$D$34=\"\",\"\",22)","v":""},"","","","","",null,28,0.92400000000000004]
[null,null,null,null,null,null,null,null,{"$f":"IF(Values!$D$22=\"\",\"\",10)","v":""},"","","","","",null,12,0.85899999999999999,null,null,null,null,null,null,null,null,null,null,null,null,null,{"$f":"IF(Values!$D$35=\"\",\"\",23)","v":""},"","","","","",null,29,0.92600000000000005]
[null,null,null,null,null,null,null,null,{"$f":"IF(Values!$D$23=\"\",\"\",11)","v":""},"","","","",""," ",14,0.874,null,null,null,null,null,null,null,null,null,null,null,null,null,{"$f":"IF(Values!$D$36=\"\",\"\",24)","v":""},"","","","","",null,30,0.92700000000000005]
[null,null,null,null,null,null,null,null,{"$f":"IF(Values!$D$24=\"\",\"\",12)","v":""},"","","","","",null,16,0.88700000000000001,null,null,null,null,null,null,null,null,null,null,null,null,null,{"$f":"IF(Values!$D$37=\"\",\"\",25)","v":""},"","","","","",null,31,0.92900000000000005]
[null,null,null,null,null,null,null,null,{"$f":"IF(Values!$D$25=\"\",\"\",13)","v":""},"","","","","",null,18,0.89700000000000002,null,null,null,null,null,null,null,null,null,null,null,null,null,{"$f":"IF(Values!$D$38=\"\",\"\",26)","v":""},"","","",null,null,null,32,0.93]
[null,null,null,null,null,null,null,null,{"$f":"IF(Values!$D$26=\"\",\"\",14)","v":""},"","","","","",null,20,0.90500000000000003,null,null,null,null,null,null,null,null,null,null,null,null,null,{"$f":"IF(Values!$D$39=\"\",\"\",27)","v":""},"","","",null,null,null,33,0.93100000000000005]
[null,null,null,null,null,null,null,null,{"$f":"IF(Values!$D$27=\"\",\"\",15)","v":""},"","","","","",null,21,0.90800000000000003,null,null,null,null,null,null,null,null,null,null,null,null,null,{"$f":"IF(Values!$D$40=\"\",\"\",28)","v":""},"","","",null,null,null,34,0.93300000000000005]
[null,null,null,null,null,null,null,null,{"$f":"IF(Values!$D$28=\"\",\"\",16)","v":""},"","","","","",null,22,0.91100000000000003,null,null,null,null,null,null,null,null,null,null,null,null,null,{"$f":"IF(Values!$D$41=\"\",\"\",29)","v":""},"","","",null,null,null,35,0.93400000000000005]
[null,null,null,null,null,null,null,null,{"$f":"IF(Values!$D$29=\"\",\"\",17)","v":""},"","","","","",null,23,0.91400000000000003,null,null,null,null,null,null,null,null,null,null,null,null,null,{"$f":"IF(Values!$D$42=\"\",\"\",30)","v":""},"","","",null,"sigma:",null,36,0.93500000000000005]
[null,null,null,null,null,null,null,null,{"$f":"IF(Values!$D$30=\"\",\"\",18)","v":""},"","","","","",null,24,0.91600000000000004,null,null,null,null,null,null,null,null,null,null,null,null,null,{"$f":"IF(Values!$D$43=\"\",\"\",31)","v":""},"","","",null,{"$f":"EF14","v":""},null,37,0.93600000000000005]
[null,null,null,null,null,null,null,null,{"$f":"IF(Values!$D$31=\"\",\"\",19)","v":""},"","","","","",null,25,0.91800000000000004,null,null,null,null,null,null,null,null,null,null,null,null,null,{"$f":"IF(Values!$D$44=\"\",\"\",32)","v":""},"","","",null,null,null,38,0.93799999999999994]
[null,null,null,null,null,null,null,null,{"$f":"IF(Values!$D$32=\"\",\"\",20)","v":""},"","","","","",null,26,0.92,null,null,null,null,null,null,null,null,null,null,null,null,null,{"$f":"IF(Values!$D$45=\"\",\"\",33)","v":""},{"$f":"DB40","v":""},{"$f":"IF(AF217=\"\",\"\",SMALL($AF$185:$AF$234,AE217))","v":""},{"$f":"IF(AF217=\"\",\"\",LARGE($AF$185:$AF$234,AE217))","v":""},null,null,null,39,0.93899999999999995]
[null,null,null,null,null,null,null,null,{"$f":"IF(Values!$D$33=\"\",\"\",21)","v":""},"","","","","",null,27,0.92300000000000004,null,null,null,null,null,null,null,null,null,null,null,null,null,{"$f":"IF(Values!$D$46=\"\",\"\",34)","v":""},"","","",null,null,null,40,0.94]
[null,null,null,null,null,null,null,null,{"$f":"IF(Values!$D$34=\"\",\"\",22)","v":""},"","","","","",null,28,0.92400000000000004,null,null,null,null,null,null,null,null,null,null,null,null,null,{"$f":"IF(Values!$D$47=\"\",\"\",35)","v":""},"","","",null,"ni (b)",null,41,0.94099999999999995]
[null,null,null,null,null,null,null,null,{"$f":"IF(Values!$D$35=\"\",\"\",23)","v":""},"","","","","",null,29,0.92600000000000005,null,null,null,null,null,null,null,null,null,null,null,null,null,{"$f":"IF(Values!$D$48=\"\",\"\",36)","v":""},"","","",null,{"$f":"IF(AJ215=\"\",\"\",SUM(AJ185:AJ209))","v":""},null,42,0.94199999999999995]
[null,null,null,null,null,null,null,null,{"$f":"IF(Values!$D$36=\"\",\"\",24)","v":""},"","","","","",null,30,0.92700000000000005,null,null,null,null,null,null,null,null,null,null,null,null,null,{"$f":"IF(Values!$D$49=\"\",\"\",37)","v":""},"","","",null,null,null,43,0.94299999999999995]
[null,null,null,null,null,null,null,null,{"$f":"IF(Values!$D$37=\"\",\"\",25)","v":""},"","","","","",null,31,0.92900000000000005,null,null,null,null,null,null,null,null,null,null,null,null,null,{"$f":"IF(Values!$D$50=\"\",\"\",38)","v":""},"","","",null,null,null,44,0.94399999999999995]
[null,null,null,null,null,null,null,null,{"$f":"IF(Values!$D$38=\"\",\"\",26)","v":""},"","","",null,null,null,32,0.93,null,null,null,null,null,null,null,null,null,null,null,null,null,{"$f":"IF(Values!$D$51=\"\",\"\",39)","v":""},"","","",null,null,null,45,0.94499999999999995]
[null,null,null,null,null,null,null,null,{"$f":"IF(Values!$D$39=\"\",\"\",27)","v":""},"","","",null,null,null,33,0.93100000000000005,null,null,null,null,null,null,null,null,null,null,null,null,null,{"$f":"IF(Values!$D$52=\"\",\"\",40)","v":""},"","","",null,"Test value AD: ",null,46,0.94499999999999995]
[null,null,null,null,null,null,null,null,{"$f":"IF(Values!$D$40=\"\",\"\",28)","v":""},"","","",null,null,null,34,0.93300000000000005,null,null,null,null,null,null,null,null,null,null,null,null,null,{"$f":"IF(Values!$D$53=\"\",\"\",41)","v":""},"","","",null,{"$f":"IF(AJ215=\"\",\"\",(SUMSQ(AJ220))/((COUNT(AF185:AF234)-1)*SUMSQ(AJ215)))","v":""},null,47,0.94599999999999995]
[null,null,null,null,null,null,null,null,{"$f":"IF(Values!$D$41=\"\",\"\",29)","v":""},"","","",null,null,null,35,0.93400000000000005,null,null,null,null,null,null,null,null,null,null,null,null,null,{"$f":"IF(Values!$D$54=\"\",\"\",42)","v":""},"","","",null,null,null,48,0.94699999999999995]
[null,null,null,null,null,null,null,null,{"$f":"IF(Values!$D$42=\"\",\"\",30)","v":""},"","","",null,"sigma:",null,36,0.93500000000000005,null,null,null,null,null,null,null,null,null,null,null,null,null,{"$f":"IF(Values!$D$55=\"\",\"\",43)","v":""},"","","",null,null,null,49,0.94699999999999995]
[null,null,null,null,null,null,null,null,{"$f":"IF(Values!$D$43=\"\",\"\",31)","v":""},"","","",null,{"$f":"DW14","v":""},null,37,0.93600000000000005,null,null,null,null,null,null,null,null,null,null,null,null,null,{"$f":"IF(Values!$D$56=\"\",\"\",44)","v":""},"","","",null,null,null,50,0.94699999999999995]
[null,null,null,null,null,null,null,null,{"$f":"IF(Values!$D$44=\"\",\"\",32)","v":""},"","","",null,null,null,38,0.93799999999999994,null,null,null,null,null,null,null,null,null,null,null,null,null,{"$f":"IF(Values!$D$57=\"\",\"\",45)","v":""},"","","",null,"Threshold SW [95%]:"]
[null,null,null,null,null,null,null,null,{"$f":"IF(Values!$D$45=\"\",\"\",33)","v":""},{"$f":"IF(DA40=\"\",\"\",DA40)","v":""},{"$f":"IF(J230=\"\",\"\",SMALL($J$198:$J$247,I230))","v":""},{"$f":"IF(J230=\"\",\"\",LARGE($J$198:$J$247,I230))","v":""},null,null,null,39,0.93899999999999995,null,null,null,null,null,null,null,null,null,null,null,null,null,{"$f":"IF(Values!$D$58=\"\",\"\",46)","v":""},"","",""]
[null,null,null,null,null,null,null,null,{"$f":"IF(Values!$D$46=\"\",\"\",34)","v":""},"","","",null,null,null,40,0.94,null,null,null,null,null,null,null,null,null,null,null,null,null,{"$f":"IF(Values!$D$59=\"\",\"\",47)","v":""},"","","",null,{"$f":"IF(AJ215=\"\",\"\",VLOOKUP(COUNT(AF185:AF234),AL186:AM228,2))","v":""},null,"H1 = True If AD < SW"]
[null,null,null,null,null,null,null,null,{"$f":"IF(Values!$D$47=\"\",\"\",35)","v":""},"","","",null,"ni (b)",null,41,0.94099999999999995,null,null,null,null,null,null,null,null,null,null,null,null,null,{"$f":"IF(Values!$D$60=\"\",\"\",48)","v":""},"","","",null,null,null,"H0 = True If AD > SW"]
[null,null,null,null,null,null,null,null,{"$f":"IF(Values!$D$48=\"\",\"\",36)","v":""},"","","",null,{"$f":"IF(N228=\"\",\"\",SUM(N198:N222))","v":""},null,42,0.94199999999999995,null,null,null,null,null,null,null,null,null,null,null,null,null,{"$f":"IF(Values!$D$61=\"\",\"\",49)","v":""},"","",""]
[null,null,null,null,null,null,null,null,{"$f":"IF(Values!$D$49=\"\",\"\",37)","v":""},"","","",null,null,null,43,0.94299999999999995,null,null,null,null,null,null,null,null,null,null,null,null,null,{"$f":"IF(Values!$D$62=\"\",\"\",50)","v":""},"","","",null,null,null,"H1: Values are normal ditributed"]
[null,null,null,null,null,null,null,null,{"$f":"IF(Values!$D$50=\"\",\"\",38)","v":""},"","","",null,null,null,44,0.94399999999999995,null,null,null,null,null,null,null,null,null,null,null,null,null,null,null,null,null,null,null,null,"H0: Values are not normal distributed"]
[null,null,null,null,null,null,null,null,{"$f":"IF(Values!$D$51=\"\",\"\",39)","v":""},"","","",null,null,null,45,0.94499999999999995]
[null,null,null,null,null,null,null,null,{"$f":"IF(Values!$D$52=\"\",\"\",40)","v":""},"","","",null,"Test value AD: ",null,46,0.94499999999999995]
[null,null,null,null,null,null,null,null,{"$f":"IF(Values!$D$53=\"\",\"\",41)","v":""},"","","",null,{"$f":"IF(N228=\"\",\"\",(SUMSQ(N233))/((COUNT(J198:J247)-1)*SUMSQ(N228)))","v":""},null,47,0.94599999999999995]
[null,null,null,null,null,null,null,null,{"$f":"IF(Values!$D$54=\"\",\"\",42)","v":""},"","","",null,null,null,48,0.94699999999999995]
[null,null,null,null,null,null,null,null,{"$f":"IF(Values!$D$55=\"\",\"\",43)","v":""},"","","",null,null,null,49,0.94699999999999995]
[null,null,null,null,null,null,null,null,{"$f":"IF(Values!$D$56=\"\",\"\",44)","v":""},"","","",null,null,null,50,0.94699999999999995]
[null,null,null,null,null,null,null,null,{"$f":"IF(Values!$D$57=\"\",\"\",45)","v":""},"","","",null,"Threshold SW [95%]:"]
[null,null,null,null,null,null,null,null,{"$f":"IF(Values!$D$58=\"\",\"\",46)","v":""},"","",""]
[null,null,null,null,null,null,null,null,{"$f":"IF(Values!$D$59=\"\",\"\",47)","v":""},"","","",null,{"$f":"IF(N228=\"\",\"\",VLOOKUP(COUNT(J198:J247),P199:Q241,2))","v":""},null,"H1 = True If AD < SW"]
[null,null,null,null,null,null,null,null,{"$f":"IF(Values!$D$60=\"\",\"\",48)","v":""},"","","",null,null,null,"H0 = True If AD > SW"]
[null,null,null,null,null,null,null,null,{"$f":"IF(Values!$D$61=\"\",\"\",49)","v":""},"","",""]
[null,null,null,null,null,null,null,null,{"$f":"IF(Values!$D$62=\"\",\"\",50)","v":""},"","","",null,null,null,"H1: Values are normal ditributed"]
[null,null,null,null,null,null,null,null,null,null,null,null,null,null,null,"H0: Values are not normal distributed"]
[]
[]
[]
[]
[null,null,null,null,null,null,null,null,null,null,"n"]
[null,null,null,null,null,null,null,null,null,null,null,4,6,8,10,12,14,null,16,18,20,22,24,26,28,30,32,34,null,36,38,40,42,44,46,48,50]
[null,null,null,null,null,null,null,null,"i",1,null,0.68720000000000003,0.6431,0.60519999999999996,0.57389999999999997,0.54749999999999999,0.52510000000000001,null,0.50560000000000005,0.18859999999999999,0.47339999999999999,0.45900000000000002,0.44929999999999998,0.44069999999999998,0.43280000000000002,0.4254,0.41880000000000001,0.41270000000000001,null,0.40679999999999999,0.40150000000000002,0.39639999999999997,0.39169999999999999,0.38719999999999999,0.38300000000000001,0.37890000000000001,0.37509999999999999]
[null,null,null,null,null,null,null,null,null,2,null,0.16769999999999999,0.28060000000000002,0.31640000000000001,0.3291,0.33250000000000002,0.33179999999999998,null,0.32900000000000001,0.32529999999999998,0.3211,0.31559999999999999,0.30980000000000002,0.30430000000000001,0.29920000000000002,0.2944,0.2898,0.28539999999999999,null,0.28129999999999999,0.27739999999999998,0.2737,0.27010000000000001,0.26669999999999999,0.26350000000000001,0.26040000000000002,0.25740000000000002]
[null,null,null,null,null,null,null,null,null,3,null,null,8.7499999999999994E-2,0.17430000000000001,0.21410000000000001,0.23469999999999999,0.246,null,0.25209999999999999,0.25530000000000003,0.25650000000000001,0.2571,0.25540000000000002,0.25330000000000003,0.251,0.2487,0.24629999999999999,0.24390000000000001,null,0.24149999999999999,0.23910000000000001,0.23680000000000001,0.23449999999999999,0.23230000000000001,0.23019999999999999,0.2281,0.22600000000000001]
[null,null,null,null,null,null,null,null,null,4,null,null,null,5.6099999999999997E-2,0.12239999999999999,0.15859999999999999,0.1802,null,0.19389999999999999,0.20269999999999999,0.20849999999999999,0.21310000000000001,0.2145,0.21510000000000001,0.21510000000000001,0.21479999999999999,0.21410000000000001,0.2132,null,0.21210000000000001,0.21099999999999999,0.20979999999999999,0.20849999999999999,0.2072,0.20580000000000001,0.20449999999999999,0.20319999999999999]
[null,null,null,null,null,null,null,null,null,5,null,null,null,null,3.9899999999999998E-2,9.2200000000000004E-2,0.124,null,0.1447,0.15809999999999999,0.1686,0.1764,0.1807,0.18360000000000001,0.1857,0.187,0.18779999999999999,0.1822,null,0.1883,0.18809999999999999,0.18779999999999999,0.18740000000000001,0.18679999999999999,0.1862,0.1855,0.1847]
[null,null,null,null,null,null,null,null,null,6,null,null,null,null,null,3.0300000000000001E-2,7.2700000000000001E-2,null,0.10050000000000001,0.1197,0.13339999999999999,0.14430000000000001,0.1512,0.15629999999999999,0.16009999999999999,0.16300000000000001,0.1651,0.16669999999999999,null,0.1678,0.1686,0.1691,0.1694,0.16950000000000001,0.16950000000000001,0.16950000000000001,0.1691]
[null,null,null,null,null,null,null,null,null,7,null,null,null,null,null,null,2.4E-2,null,5.9299999999999999E-2,8.3699999999999997E-2,0.1013,0.115,0.1245,0.13159999999999999,0.13719999999999999,0.14149999999999999,0.1449,0.14749999999999999,null,0.14960000000000001,0.15129999999999999,0.15260000000000001,0.1535,0.1542,0.15479999999999999,0.15509999999999999,0.15540000000000001]
[null,null,null,null,null,null,null,null,null,8,null,null,null,null,null,null,null,null,1.9599999999999999E-2,4.9599999999999998E-2,7.1099999999999997E-2,8.7800000000000003E-2,9.9699999999999997E-2,0.1089,0.1162,0.12189999999999999,0.1265,0.13009999999999999,null,0.1331,0.1356,0.1376,0.13919999999999999,0.14050000000000001,0.14149999999999999,0.14230000000000001,0.14299999999999999]
[null,null,null,null,null,null,null,null,null,9,null,null,null,null,null,null,null,null,null,1.6299999999999999E-2,4.2200000000000001E-2,6.1800000000000001E-2,7.6399999999999996E-2,8.7599999999999997E-2,9.6500000000000002E-2,0.1036,0.10929999999999999,0.114,null,0.1179,0.1211,0.1237,0.12590000000000001,0.1278,0.1293,0.13059999999999999,0.13170000000000001]
[null,null,null,null,null,null,null,null,null,10,null,null,null,null,null,null,null,null,null,null,1.4E-2,3.6799999999999999E-2,5.3900000000000003E-2,6.7199999999999996E-2,7.7799999999999994E-2,8.6199999999999999E-2,9.3100000000000002E-2,9.8799999999999999E-2,null,0.1036,0.1075,0.1108,0.11360000000000001,0.11600000000000001,0.11799999999999999,0.1197,0.1212]
[null,null,null,null,null,null,null,null,null,11,null,null,null,null,null,null,null,null,null,null,null,1.2200000000000001E-2,3.2099999999999997E-2,4.7600000000000003E-2,5.9799999999999999E-2,6.9699999999999998E-2,7.7700000000000005E-2,8.4400000000000003E-2,null,0.09,9.4700000000000006E-2,9.8599999999999993E-2,0.10199999999999999,0.10489999999999999,0.10730000000000001,0.1095,0.1113]
[null,null,null,null,null,null,null,null,null,12,null,null,null,null,null,null,null,null,null,null,null,null,1.0699999999999999E-2,2.8400000000000002E-2,4.24E-2,5.3699999999999998E-2,6.2899999999999998E-2,7.0599999999999996E-2,null,7.6999999999999999E-2,8.2400000000000001E-2,8.6999999999999994E-2,9.0899999999999995E-2,9.4299999999999995E-2,9.7199999999999995E-2,9.98E-2,0.10199999999999999]
[null,null,null,null,null,null,null,null,null,13,null,null,null,null,null,null,null,null,null,null,null,null,null,9.4000000000000004E-3,2.53E-2,3.8100000000000002E-2,4.8500000000000001E-2,5.7200000000000001E-2,null,6.4500000000000002E-2,7.0599999999999996E-2,7.5899999999999995E-2,8.0399999999999999E-2,8.4199999999999997E-2,8.7599999999999997E-2,9.06E-2,9.3200000000000005E-2]
[null,null,null,null,null,null,null,null,null,14,null,null,null,null,null,null,null,null,null,null,null,null,null,null,8.3999999999999995E-3,2.2700000000000001E-2,3.44E-2,4.41E-2,null,5.2299999999999999E-2,5.9200000000000003E-2,6.5100000000000005E-2,7.0099999999999996E-2,7.4499999999999997E-2,7.85E-2,8.1699999999999995E-2,8.4599999999999995E-2]
[null,null,null,null,null,null,null,null,null,15,null,null,null,null,null,null,null,null,null,null,null,null,null,null,null,7.6E-3,2.06E-2,3.1399999999999997E-2,null,4.0399999999999998E-2,4.8099999999999997E-2,5.4600000000000003E-2,6.0199999999999997E-2,6.5100000000000005E-2,6.9400000000000003E-2,7.3099999999999998E-2,7.6399999999999996E-2]
[null,null,null,null,null,null,null,null,null,16,null,null,null,null,null,null,null,null,null,null,null,null,null,null,null,null,6.7999999999999996E-3,1.8700000000000001E-2,null,2.87E-2,3.7199999999999997E-2,4.4400000000000002E-2,5.0599999999999999E-2,5.6000000000000001E-2,6.0699999999999997E-2,6.4799999999999996E-2,6.8500000000000005E-2]
[null,null,null,null,null,null,null,null,null,17,null,null,null,null,null,null,null,null,null,null,null,null,null,null,null,null,null,6.1999999999999998E-3,null,1.72E-2,2.64E-2,3.4299999999999997E-2,4.1099999999999998E-2,4.7100000000000003E-2,5.2200000000000003E-2,5.6800000000000003E-2,6.08E-2]
[null,null,null,null,null,null,null,null,null,18,null,null,null,null,null,null,null,null,null,null,null,null,null,null,null,null,null,null,null,5.7000000000000002E-3,1.5800000000000002E-2,2.4400000000000002E-2,3.1800000000000002E-2,3.8300000000000001E-2,4.3900000000000002E-2,4.8899999999999999E-2,5.3199999999999997E-2]
[null,null,null,null,null,null,null,null,null,19,null,null,null,null,null,null,null,null,null,null,null,null,null,null,null,null,null,null,null,null,5.3E-3,1.46E-2,2.2700000000000001E-2,2.9600000000000001E-2,3.5700000000000003E-2,4.1099999999999998E-2,4.5900000000000003E-2]
[null,null,null,null,null,null,null,null,null,20,null,null,null,null,null,null,null,null,null,null,null,null,null,null,null,null,null,null,null,null,null,4.8999999999999998E-3,1.3599999999999999E-2,2.1100000000000001E-2,2.7699999999999999E-2,3.3500000000000002E-2,3.8600000000000002E-2]
[null,null,null,null,null,null,null,null,null,21,null,null,null,null,null,null,null,null,null,null,null,null,null,null,null,null,null,null,null,null,null,null,4.4999999999999997E-3,1.26E-2,1.9699999999999999E-2,2.5899999999999999E-2,3.1399999999999997E-2]
[null,null,null,null,null,null,null,null,null,22,null,null,null,null,null,null,null,null,null,null,null,null,null,null,null,null,null,null,null,null,null,null,null,4.1999999999999997E-3,1.18E-2,1.8499999999999999E-2,2.4400000000000002E-2]
[null,null,null,null,null,null,null,null,null,23,null,null,null,null,null,null,null,null,null,null,null,null,null,null,null,null,null,null,null,null,null,null,null,null,3.8999999999999998E-3,1.11E-2,1.7399999999999999E-2]
[null,null,null,null,null,null,null,null,null,24,null,null,null,null,null,null,null,null,null,null,null,null,null,null,null,null,null,null,null,null,null,null,null,null,null,3.7000000000000002E-3,1.04E-2]
[null,null,null,null,null,null,null,null,null,25,null,null,null,null,null,null,null,null,null,null,null,null,null,null,null,null,null,null,null,null,null,null,null,null,null,null,3.5000000000000001E-3]

{"sheet":"Settings","index":5,"n_rows":26,"n_cols":8,"rows_kept":26,"cut":false,"hidden":true,"merged":[[27,7,28,10],[27,11,28,13],[25,7,26,10],[25,11,26,13],[16,1,16,5],[17,4,18,5],[19,4,19,5],[21,7,22,10],[21,11,22,13],[23,7,24,10],[23,11,24,13],[22,1,22,3],[19,7,20,10],[19,11,20,13],[13,4,13,5],[13,7,14,10],[6,7,8,13],[7,1,7,2],[7,3,7,5],[10,1,10,5],[11,4,12,5]]}
[]
[]
[]
[]
[]
[]
[null,null,null,null,null,null,null,"The integrated macros in this Worksheet are not required for the calculation. The macros just handle the scaling of the integrated charts. If you do not activate the macros, the sheet is still capable to calculate trustwothy indicies."]
[null,"Scale on",null,"Values"]
[]
[]
[null,"Scale on Spec Limits"]
[null,null,"Upper","Lower","Scale-Factor \n(Standart = 0,05)"]
[null,"Limtes",{"$f":"IF(PRODSTRING17=\"\",0,_xlfn.NUMBERVALUE(PRODSTRING17))","v":0},{"$f":"IF(PRODSTRING18=\"\",0,_xlfn.NUMBERVALUE(PRODSTRING18))","v":0}]
[null,"Scale on",{"$f":"IF(C13=\"\",\"\",C13+(MAX(C13,D13)-MIN(C13,D13))*E14)","v":0},{"$f":"IF(D13=\"\",\"\",D13-(MAX(C13:D13)-MIN(C13:D13))*E14)","v":0},0.1,null,null,"Print a pdf of the register \"Visualization\" to a folder of your choice."]
[]
[]
[null,"Scale on Values"]
[null,null,"Upper","Lower","Scale-Factor \n(Standart = 0,3)"]
[null,"Max/Min",{"$f":"Calculation!DW9","v":""},{"$f":"Calculation!DW10","v":""}]
[null,"Scale on",{"$f":"IF(C19=\"\",\"\",C19+(C19-D19)*E20)","v":""},{"$f":"IF(D19=\"\",\"\",D19-(C19-D19)*E20)","v":""},0.1,null,null,"Guide (A \"How to\" handle this document)"]
[]
[null,null,null,null,null,null,null,"Calculations (Distribution; Graphics; Indices)"]
[null,"Custom scaling"]
[null,null,"Lower","Upper",null,null,null,"Directories (Resolution, Measrumentdevices, Units)"]
[null,"Scale on"]
[null,null,null,null,null,null,null,"References (Calculation references)"]

{"sheet":"Goal Seek","index":6,"n_rows":56,"n_cols":13,"rows_kept":56,"cut":false,"hidden":true,"merged":[[6,10,6,11],[23,9,25,12],[5,10,5,11],[4,2,5,2],[13,10,13,12],[4,4,5,4],[18,9,19,12],[4,3,5,3],[4,5,4,6]]}
[]
[null,null,"Goal Seek Process"]
[]
[]
[null,null,"Values \n(Current)","Values (already calculated)","Check of Matching","Weibull"]
[null,null,null,null,null,"Epsilon-","Epsilon+",null,null,"Active Paramter","Epsilon Factor"]
[null,null,{"$f":"IFERROR(SMALL(Calculation!$DA$8:$DA$57,Calculation!CZ8),\"\")","v":""},6.0649493999999997,{"$f":"C7=D7","v":false},{"$f":"IF(C7=\"\",\"\",LN((($L$11-$L$12)*((C7-$M$11-$M$12)/($K$11-$K$12))^($L$11-1-$L$12)*EXP(-1*((C7-$M$11-$M$12)/($K$11-$K$12))^($L$11-$L$12)))/($K$11-$K$12)))","v":""},{"$f":"IF(C7=\"\",\"\",LN((($L$11+$L$12)*((C7-$M$11+$M$12)/($K$11+$K$12))^($L$11-1+$L$12)*EXP(-1*((C7-$M$11+$M$12)/($K$11+$K$12))^($L$11+$L$12)))/($K$11+$K$12)))","v":""},null,null,1,1E-3]
[null,null,{"$f":"IFERROR(SMALL(Calculation!$DA$8:$DA$57,Calculation!CZ9),\"\")","v":""},6.0649493999999997,{"$f":"C8=D8","v":false},{"$f":"IF(C8=\"\",\"\",LN((($L$11-$L$12)*((C8-$M$11-$M$12)/($K$11-$K$12))^($L$11-1-$L$12)*EXP(-1*((C8-$M$11-$M$12)/($K$11-$K$12))^($L$11-$L$12)))/($K$11-$K$12)))","v":""},{"$f":"IF(C8=\"\",\"\",LN((($L$11+$L$12)*((C8-$M$11+$M$12)/($K$11+$K$12))^($L$11-1+$L$12)*EXP(-1*((C8-$M$11+$M$12)/($K$11+$K$12))^($L$11+$L$12)))/($K$11+$K$12)))","v":""}]
[null,null,{"$f":"IFERROR(SMALL(Calculation!$DA$8:$DA$57,Calculation!CZ10),\"\")","v":""},6.0773545999999996,false,"","",null,null,"Weibull (3 Parameter)"]
[null,null,{"$f":"IFERROR(SMALL(Calculation!$DA$8:$DA$57,Calculation!CZ11),\"\")","v":""},6.0773545999999996,false,"","",null,null,"Parameter","Alpha","Beta","Lamda"]
[null,null,{"$f":"IFERROR(SMALL(Calculation!$DA$8:$DA$57,Calculation!CZ12),\"\")","v":""},6.0912005999999996,false,"","",null,null,"Values",7.3335441553611034,116.85099166026747,-1.0839758639370973]
[null,null,{"$f":"IFERROR(SMALL(Calculation!$DA$8:$DA$57,Calculation!CZ13),\"\")","v":""},6.0912005999999996,false,"","",null,null,"Epsilon Factor",{"$f":"IF(J7=1,K11*K7,0)","v":7.3335441553611033E-3},{"$f":"IF(J7=2,L11*K7,0)","v":0},{"$f":"IF(J7=3,M11*K7,0)","v":0}]
[null,null,{"$f":"IFERROR(SMALL(Calculation!$DA$8:$DA$57,Calculation!CZ14),\"\")","v":""},6.1042230999999996,false,"",""]
[null,null,{"$f":"IFERROR(SMALL(Calculation!$DA$8:$DA$57,Calculation!CZ15),\"\")","v":""},6.1042230999999996,false,"","",null,null,"Likelihood Faktor",{"$f":"100*(SUM(G$7:G$56)-SUM(F$7:F$56)) /SUM(K12:M12)","v":0}]
[null,null,{"$f":"IFERROR(SMALL(Calculation!$DA$8:$DA$57,Calculation!CZ16),\"\")","v":""},6.1420946000000001,false,"",""]
[null,null,{"$f":"IFERROR(SMALL(Calculation!$DA$8:$DA$57,Calculation!CZ17),\"\")","v":""},6.1420946000000001,false,"",""]
[null,null,{"$f":"IFERROR(SMALL(Calculation!$DA$8:$DA$57,Calculation!CZ18),\"\")","v":""},6.1783919000000003,false,"",""]
[null,null,{"$f":"IFERROR(SMALL(Calculation!$DA$8:$DA$57,Calculation!CZ19),\"\")","v":""},6.1783919000000003,false,"",""]
[null,null,{"$f":"IFERROR(SMALL(Calculation!$DA$8:$DA$57,Calculation!CZ20),\"\")","v":""},6.1869965000000002,false,"","",null,null,{"$f":"IF(COUNTIF(E7:E56,FALSE)<>0,\"Calculation required!\",\"Calculation was already performed and is still valid.\")","v":"Calculation required!"}]
[null,null,{"$f":"IFERROR(SMALL(Calculation!$DA$8:$DA$57,Calculation!CZ21),\"\")","v":""},6.1869965000000002,false,"",""]
[null,null,{"$f":"IFERROR(SMALL(Calculation!$DA$8:$DA$57,Calculation!CZ22),\"\")","v":""},6.1876787000000002,false,"","",null,null,{"$f":"IF(COUNTIF(E7:E56,FALSE)<>0,0,1)","v":0}]
[null,null,{"$f":"IFERROR(SMALL(Calculation!$DA$8:$DA$57,Calculation!CZ23),\"\")","v":""},6.1876787000000002,false,"",""]
[null,null,{"$f":"IFERROR(SMALL(Calculation!$DA$8:$DA$57,Calculation!CZ24),\"\")","v":""},6.1914474000000004,false,"",""]
[null,null,{"$f":"IFERROR(SMALL(Calculation!$DA$8:$DA$57,Calculation!CZ25),\"\")","v":""},6.1914474000000004,false,"","",null,null,"Calculation is ongoing...\nThis can take up to 90 seconds"]
[null,null,{"$f":"IFERROR(SMALL(Calculation!$DA$8:$DA$57,Calculation!CZ26),\"\")","v":""},6.1968572000000002,false,"",""]
[null,null,{"$f":"IFERROR(SMALL(Calculation!$DA$8:$DA$57,Calculation!CZ27),\"\")","v":""},6.1968572000000002,false,"",""]
[null,null,{"$f":"IFERROR(SMALL(Calculation!$DA$8:$DA$57,Calculation!CZ28),\"\")","v":""},6.1999957999999999,false,"",""]
[null,null,{"$f":"IFERROR(SMALL(Calculation!$DA$8:$DA$57,Calculation!CZ29),\"\")","v":""},6.1999957999999999,false,"",""]
[null,null,{"$f":"IFERROR(SMALL(Calculation!$DA$8:$DA$57,Calculation!CZ30),\"\")","v":""},6.2003746,false,"",""]
[null,null,{"$f":"IFERROR(SMALL(Calculation!$DA$8:$DA$57,Calculation!CZ31),\"\")","v":""},6.2003746,false,"",""]
[null,null,{"$f":"IFERROR(SMALL(Calculation!$DA$8:$DA$57,Calculation!CZ32),\"\")","v":""},6.2238376000000004,false,"",""]
[null,null,{"$f":"IFERROR(SMALL(Calculation!$DA$8:$DA$57,Calculation!CZ33),\"\")","v":""},6.2238376000000004,false,"",""]
[null,null,{"$f":"IFERROR(SMALL(Calculation!$DA$8:$DA$57,Calculation!CZ34),\"\")","v":""},6.2368242,false,"",""]
[null,null,{"$f":"IFERROR(SMALL(Calculation!$DA$8:$DA$57,Calculation!CZ35),\"\")","v":""},6.2368242,false,"",""]
[null,null,{"$f":"IFERROR(SMALL(Calculation!$DA$8:$DA$57,Calculation!CZ36),\"\")","v":""},6.2420872000000003,false,"",""]
[null,null,{"$f":"IFERROR(SMALL(Calculation!$DA$8:$DA$57,Calculation!CZ37),\"\")","v":""},6.2420872000000003,false,"",""]
[null,null,{"$f":"IFERROR(SMALL(Calculation!$DA$8:$DA$57,Calculation!CZ38),\"\")","v":""},6.2463894,false,"",""]
[null,null,{"$f":"IFERROR(SMALL(Calculation!$DA$8:$DA$57,Calculation!CZ39),\"\")","v":""},6.2463894,false,"",""]
[null,null,{"$f":"IFERROR(SMALL(Calculation!$DA$8:$DA$57,Calculation!CZ40),\"\")","v":""},6.2468683,false,"",""]
[null,null,{"$f":"IFERROR(SMALL(Calculation!$DA$8:$DA$57,Calculation!CZ41),\"\")","v":""},6.2468683,false,"",""]
[null,null,{"$f":"IFERROR(SMALL(Calculation!$DA$8:$DA$57,Calculation!CZ42),\"\")","v":""},6.2679324999999997,false,"",""]
[null,null,{"$f":"IFERROR(SMALL(Calculation!$DA$8:$DA$57,Calculation!CZ43),\"\")","v":""},6.2679324999999997,false,"",""]
[null,null,{"$f":"IFERROR(SMALL(Calculation!$DA$8:$DA$57,Calculation!CZ44),\"\")","v":""},6.2688817999999999,false,"",""]
[null,null,{"$f":"IFERROR(SMALL(Calculation!$DA$8:$DA$57,Calculation!CZ45),\"\")","v":""},6.2688817999999999,false,"",""]
[null,null,{"$f":"IFERROR(SMALL(Calculation!$DA$8:$DA$57,Calculation!CZ46),\"\")","v":""},6.2740938000000002,false,"",""]
[null,null,{"$f":"IFERROR(SMALL(Calculation!$DA$8:$DA$57,Calculation!CZ47),\"\")","v":""},6.2740938000000002,false,"",""]
[null,null,{"$f":"IFERROR(SMALL(Calculation!$DA$8:$DA$57,Calculation!CZ48),\"\")","v":""},6.2740938000000002,false,"",""]
[null,null,{"$f":"IFERROR(SMALL(Calculation!$DA$8:$DA$57,Calculation!CZ49),\"\")","v":""},6.2740938000000002,false,"",""]
[null,null,{"$f":"IFERROR(SMALL(Calculation!$DA$8:$DA$57,Calculation!CZ50),\"\")","v":""},6.2904027999999998,false,"",""]
[null,null,{"$f":"IFERROR(SMALL(Calculation!$DA$8:$DA$57,Calculation!CZ51),\"\")","v":""},6.2904027999999998,false,"",""]
[null,null,{"$f":"IFERROR(SMALL(Calculation!$DA$8:$DA$57,Calculation!CZ52),\"\")","v":""},6.3126857999999997,false,"",""]
[null,null,{"$f":"IFERROR(SMALL(Calculation!$DA$8:$DA$57,Calculation!CZ53),\"\")","v":""},6.3126857999999997,false,"",""]
[null,null,{"$f":"IFERROR(SMALL(Calculation!$DA$8:$DA$57,Calculation!CZ54),\"\")","v":""},6.3221429000000002,false,"",""]
[null,null,{"$f":"IFERROR(SMALL(Calculation!$DA$8:$DA$57,Calculation!CZ55),\"\")","v":""},6.3221429000000002,false,"",""]
[null,null,{"$f":"IFERROR(SMALL(Calculation!$DA$8:$DA$57,Calculation!CZ56),\"\")","v":""},6.3373498999999995,false,"",""]
[null,null,{"$f":"IFERROR(SMALL(Calculation!$DA$8:$DA$57,Calculation!CZ57),\"\")","v":""},6.3373498999999995,false,"",""]

{"sheet":"Directories","index":7,"n_rows":18,"n_cols":6,"rows_kept":18,"cut":false,"hidden":true,"merged":[]}
[]
[]
[]
[null,"Resolution",null,"Unit",null,"Measurement system"]
[null,1,null,"µm",null,"Height Gauge"]
[null,0.5,null,"mm",null,"Precision scale"]
[null,0.1,null,"m",null,"Packing scale"]
[null,0.05,null,"Nm",null,"Flux measurment"]
[null,0.01,null,"A",null,"Final Test"]
[null,5.0000000000000001E-3,null,"mA",null,"Noise chamber"]
[null,1E-3,null,"V",null,"Vibration sensor"]
[null,5.0000000000000001E-4,null,"Pa/s",null,"LDV"]
[null,1E-4,null,"µVs",null,"AOI Grease"]
[null,5.0000000000000002E-5,null,"bar",null,"AOI Soldering"]
[null,1.0000000000000001E-5,null,"mg"]
[null,null,null,"g"]
[null,null,null,"%"]
[null,null,null,"Pixel"]

{"sheet":"References","index":8,"n_rows":13,"n_cols":2,"rows_kept":13,"cut":false,"hidden":true,"merged":[[3,1,8,9],[12,1,13,7]]}
[]
[]
[]
[null,"Calculation according software \"Minitab® 16.1.0\".\n\n©  2010 Minitab Inc.  All rights reserved.\nMINITAB®  and the MINITAB logo™  are trademarks of Minitab Inc.  All other marks referenced remain the property of their respective owners.\n\nPortions of this product were created using LEADTOOLS © 1991-2004, LEAD Technologies, Inc.  ALL RIGHTS RESERVED."]
[]
[]
[]
[]
[]
[]
[]
[]
[null,"Detailed references and calculation information are located in the Managment System doc-nr. 1758."]