{"text_format":"1","workbook":"xlsx","n_sheets":8,"sheets":["Guide","Visualization","Graphics","Values","Calculation","Settings","Directories","References"],"not_rendered":{"charts":9,"images":23,"macros":1,"external_links":0,"defined_names":64,"comments":1,"pivot_tables":0},"unopened":[],"bounds":{"document_bytes":16777216,"sheet_cells":100000,"rows_first":2000,"rows_last":500,"rows_between":2000,"halvings":0,"cell_chars":16384,"cell_head_chars":4096},"cells_cut":0,"cells_raw":0,"read":"whole","date_system":"1900"}

{"sheet":"Guide","index":0,"n_rows":233,"n_cols":7,"rows_kept":233,"cut":false,"hidden":true,"merged":[[188,1,189,8],[201,1,202,8],[198,1,199,8],[374,1,379,8],[37,3,37,7],[113,1,113,2],[113,3,113,7],[146,1,146,2],[146,3,146,7],[148,3,148,7],[288,6,288,8],[290,6,292,8],[296,6,298,8],[330,2,332,7],[343,2,345,7],[356,6,360,8],[171,6,172,8],[116,1,116,2],[116,3,116,7],[147,1,147,2],[147,3,147,7],[148,1,148,2],[149,1,149,2],[149,3,149,7],[156,6,158,8],[160,6,162,8],[165,6,167,8],[62,2,63,7],[80,2,80,7],[114,1,114,2],[114,3,114,7],[115,1,115,2],[115,3,115,7],[60,2,61,7],[29,3,32,7],[33,3,34,7],[35,3,36,7],[38,3,39,7],[54,2,55,7],[56,2,56,7],[57,2,57,7],[58,2,58,7],[59,2,59,7],[4,2,4,8],[5,1,5,8],[9,3,9,6],[25,3,26,7],[27,3,28,7]]}
[]
[]
[]
[]
[null,"Important:"]
[null,"This file based on an Office 2010 version. For correct visualization and calculation use Office 2010 or higher."]
[]
[null,"Information:"]
[]
[null,null,null,"If a cell is gray, a input is mandatory"]
[]
[]
[]
[]
[null,"1.1 Open register \"Visualization\""]
[]
[]
[]
[]
[]
{"$rows_left_out":214}
{"sheet":"Visualization","index":1,"n_rows":73,"n_cols":21,"rows_kept":73,"cut":false,"hidden":false,"merged":[[72,1,72,15],[83,10,83,14],[61,4,61,5],[64,4,64,5],[86,10,86,14],[80,10,80,14],[35,4,35,6],[61,2,61,3],[59,2,59,3],[58,2,58,3],[58,4,58,5],[53,13,53,14],[66,2,66,14],[55,2,55,4],[54,2,54,4],[55,13,55,14],[54,13,54,14],[64,2,64,3],[51,5,51,8],[52,5,52,8],[53,5,53,8],[54,5,54,8],[55,5,55,8],[58,14,61,14],[1,1,2,12],[9,2,9,4],[9,5,9,10],[12,13,12,14],[10,2,10,4],[10,5,10,10],[61,6,61,11],[64,6,64,11],[34,10,34,14],[34,8,34,9],[51,13,51,14],[52,13,52,14],[36,8,36,10],[35,8,35,9],[34,2,34,3],[35,2,35,3],[34,4,34,6],[58,6,58,11],[63,6,63,8],[60,6,60,8],[53,10,53,12],[54,10,54,12],[55,10,55,12],[11,13,11,14],[13,13,13,14],[9,13,9,14],[8,2,8,4],[8,5,8,10],[10,13,10,14],[7,13,7,14],[8,13,8,14],[5,2,5,4],[5,5,5,10],[6,2,7,4],[6,5,7,10],[3,12,5,14],[12,2,12,4],[12,5,12,10],[11,2,11,4],[11,5,11,10],[16,5,17,12],[16,14,20,15],[18,2,18,4],[18,5,18,7],[18,9,18,10],[18,11,18,12],[19,2,19,4],[19,5,19,7],[19,9,19,10],[19,11,19,12],[20,2,20,4],[20,5,20,7],[20,9,20,10],[20,11,20,12],[16,2,17,4],[24,2,24,3],[24,7,24,10],[25,2,25,3],[25,7,25,10],[26,2,26,3],[26,7,26,10],[21,11,21,12],[21,2,22,5],[23,2,23,3],[23,7,23,10],[30,2,30,3],[30,7,30,10],[31,2,31,3],[31,7,31,10],[32,2,32,3],[32,7,32,10],[27,2,27,3],[27,7,27,10],[28,2,28,3],[28,7,28,10],[29,2,29,3],[29,7,29,10],[33,2,33,3],[33,7,33,10],[49,2,49,5],[51,10,51,12],[52,10,52,12],[51,2,51,4],[52,2,52,4],[53,2,53,4],[57,6,57,8],[56,2,57,5]]}
[]
[null,"   M1_Measurementsystemanalysis"]
[]
[null,null,null,null,null,null,null,null,null,null,null,null,"Feature Independent"]
[null,null,null,null,null,null,null,null,null,null,null,null,null,null,null,null,null,null,null,null,{"$f":"IF(OR($R$66=\"No\",$K$75<$K$87),1,\"\")","v":""}]
[null,null,"Location:"]
[null,null,"Line:"]
[null,null,null,null,null,null,null,null,null,null,null,null,"Base ID:"]
[null,null,"Meas. System-Name:",null,null,null,null,null,null,null,null,null,"Revision:"]
[null,null,"Meas. System-No.:",null,null,null,null,null,null,null,null,null,"Version:"]
[null,null,"Resolution:",null,null,null,null,null,null,null,null,null,"Released by (ID):"]
[null,null,"Master Number:",null,null,null,null,null,null,null,null,null,"Released by:"]
[null,null,"Date of Data collection:",null,null,null,null,null,null,null,null,null,"Date of release:"]
[null,null,null,null,null,null,null,null,null,null,null,null,"Doc. Status:"]
[]
[null,null,null,null,null,null,null,null,null,null,null,null,null,null,null,null,null,null,null,null,{"$f":"IF(OR($R$65=\"No\",$K$68<$K$86),1,\"\")","v":""}]
[null,null,"Feature:",null,null,null,null,null,null,null,null,null,null,null,"Feature \nDependent"]
[]
[null,null,"Unit:",null,null,null,null,null,null,{"$f":"IF(AND(F21=\"Only USL/LSL is specified\",L20<>\"\"),\"\",\"USL:\")","v":"USL:"}]
[null,null,"Real Value:",null,null,null,null,null,null,{"$f":"IF(F21=\"One side is limited\",\"\",IF(AND(L19<>\"\",F21=\"One side is limited\"),\"\",IF(AND(F21=\"Only USL/LSL is specified\",L19<>\"\"),\"\",\"LSL:\")))","v":"LSL:"}]
{"$rows_left_out":54}
{"sheet":"Graphics","index":2,"n_rows":158,"n_cols":22,"rows_kept":158,"cut":false,"hidden":false,"merged":[]}
[]
[]
[]
[]
[]
[]
[]
[]
[]
[]
[]
[]
[]
[]
[]
[]
[]
[]
[]
[]
{"$rows_left_out":139}
{"sheet":"Values","index":3,"n_rows":53,"n_cols":3,"rows_kept":53,"cut":false,"hidden":true,"merged":[]}
[]
[]
[null,"Nr.","I - Values"]
[null,{"$f":"IF(C4=\"\",\"\",1)","v":""}]
[null,{"$f":"IF(C5=\"\",\"\",B4+1)","v":""}]
[null,{"$f":"IF(C6=\"\",\"\",B5+1)","v":""}]
[null,""]
[null,""]
[null,""]
[null,""]
[null,""]
[null,""]
[null,""]
[null,""]
[null,""]
[null,""]
[null,""]
[null,""]
[null,""]
[null,""]
{"$rows_left_out":34}
{"sheet":"Calculation","index":4,"n_rows":216,"n_cols":52,"rows_kept":216,"cut":false,"hidden":true,"merged":[[5,46,6,46],[5,47,6,47],[5,48,6,48],[5,29,6,29],[5,30,6,30],[5,31,6,31],[5,32,6,32],[5,40,6,40],[5,41,6,42],[8,2,9,3],[8,4,9,4],[8,5,9,5],[8,6,9,6],[8,7,9,7],[8,8,9,8],[5,43,6,43],[5,44,6,44],[5,45,6,45],[5,22,6,22],[5,24,6,24],[5,25,6,25],[5,26,6,26],[5,27,6,27],[5,28,6,28],[5,2,7,3],[5,4,7,4],[5,5,5,6],[5,7,7,7],[5,8,7,8],[5,21,6,21],[6,5,7,5],[6,6,7,6],[10,10,11,10],[10,17,10,18],[12,10,13,10],[10,2,11,3],[10,4,11,4],[10,5,11,5],[10,6,11,6],[10,7,11,7],[10,8,11,8],[15,13,15,14],[14,2,15,3],[14,4,15,4],[14,5,15,5],[14,6,15,6],[14,7,15,7],[14,8,15,8],[12,2,13,3],[12,4,13,4],[12,5,13,5],[12,6,13,6],[12,7,13,7],[12,8,13,8],[31,13,32,13],[31,14,32,14],[31,16,32,16],[31,17,32,17],[19,13,19,14],[18,2,19,8],[23,34,24,34],[23,35,24,36],[29,34,30,34],[29,35,30,36],[27,34,28,34],[27,35,28,36],[31,35,32,36],[31,34,32,34],[25,34,26,34],[25,35,26,36],[20,2,23,8],[52,2,53,2],[52,3,53,3],[52,4,53,4],[52,5,53,5],[52,6,53,6],[107,2,107,3],[107,8,107,9],[108,2,109,3],[108,8,108,9],[52,7,53,7],[52,8,53,8],[52,9,53,9],[123,2,124,3],[123,4,124,4],[123,5,124,5],[123,7,124,10],[127,2,127,3],[128,2,128,3],[110,8,110,10],[111,8,111,10],[112,2,112,3],[113,2,114,3],[114,5,115,10],[121,2,122,3],[134,2,135,2],[134,3,135,3],[134,4,135,4],[134,5,135,5],[134,6,135,6],[134,7,135,7],[134,9,135,10],[189,4,189,28],[191,2,215,2],[166,7,167,7],[171,7,172,7],[176,7,177,7],[180,7,181,7],[182,7,183,7],[182,9,182,10],[183,9,183,10],[37,34,38,34],[37,35,38,36],[33,34,34,34],[33,35,34,36],[35,34,36,34],[35,35,36,36],[43,34,43,35],[185,9,185,10],[186,9,186,10],[49,35,49,36],[50,35,50,36],[51,35,51,36],[52,35,52,36],[42,34,42,35],[52,10,53,10]]}
[]
[]
[]
[]
[]
[null,null,"Tests",null,null,"Requested to use",null,"Normel distribution is proved",null,null,null,null,null,"I - Bar",{"$f":"IF(Values!$B$53=\"\",\"\",AVERAGE(W8:W57))","v":""},null,"MR - Bar",{"$f":"IF(O6=\"\",\"\",AVERAGE(Y8:Y57))","v":""},null,null,null,"Nr.","I - Values",null,"MR -\nValues","I - Average","MR - Average","USL","LSL","I-UEL","I-LEL","MR-UEL","Real Value",null,"Number of values:",{"$f":"IF(W8=\"\",\"\",COUNT(W8:W57))","v":""},null,null,null,null,"Classes","Values per class",null,"Number of values per class [%]","Number of values per class [%] (accumulated)","USL","LSL","Amount of classes","Real Value",null,"Y- Values","Y- Values (accumulated)"]
[null,null,null,null,null,"System (Secondary)","User (Primary)",null,null,null,null,null,null,null,null,null,"MR sigma",{"$f":"IF(O6=\"\",\"\",R6/O12)","v":""},null,null,null,null,null,null,null,null,null,null,null,null,null,null,null,null,"Max value",{"$f":"IF(W8=\"\",\"\",MAX(W8:W57))","v":""},null,null,null,null,null,null,null,null,null,null,null,null,null,null,{"$f":"IF($AO8=\"\",\"\",NORMDIST($AO8-$AJ$11,$O$6,$AJ$12,0))","v":""},{"$f":"IF(AO8=\"\",\"\",NORMDIST(AO8-$AJ$11,$O$6,$AJ$12,1)*100)","v":""}]
[null,null,null,null,null,null,null,null,null,null,null,null,null,null,null,null,null,null,null,null,null,{"$f":"IF(W8=\"\",\"\",1)","v":""},{"$f":"IF(Values!C4=\"\",\"\",Values!C4)","v":""},null,{"$f":"IF(W8=\"\",\"\",0)","v":""},{"$f":"IF(W8=\"\",\"\",AVERAGE($W$8:$W$57))","v":""},{"$f":"IF(Y8=\"\",\"\",AVERAGE($Y$8:$Y$57))","v":""},{"$f":"IF($AJ$16=\"\",\"\",$AJ$16)","v":""},{"$f":"IF($AJ$17=\"\",\"\",$AJ$17)","v":""},{"$f":"IF(W8=\"\",\"\",Calculation!$S$12)","v":""},{"$f":"IF(W8=\"\",\"\",Calculation!$S$13)","v":""},{"$f":"IF(W8=\"\",\"\",Calculation!$O$17)","v":""},{"$f":"IF($AJ$20=\"\",\"\",$AJ$20)","v":""},null,"Min value",{"$f":"IF(W8=\"\",\"\",MIN(W8:W57))","v":""},null,null,null,null,{"$f":"IF(Values!$B$53=\"\",\"\",IF($AJ$6<15,\"\",AJ8-2*AJ11))","v":""},{"$f":"IF(AO8=\"\",\"\",IF(OR(COUNT($W$8:$W$57)=AP6,AP6=\"\"),\"\",FREQUENCY($W$8:$W$57,AO8)))","v":""},{"$f":"AP8","v":""},{"$f":"IF(AQ8=\"\",\"\",(100/(SUM($AQ$8:$AQ$27))*AQ8))","v":""},{"$f":"IF(AQ8=\"\",\"\",AR8)","v":""},{"$f":"IF(AS8=\"\",\"\",$AJ$16)","v":""},{"$f":"IF(AS8=\"\",\"\",$AJ$17)","v":""},{"$f":"IF(AP8=\"\",\"\",MAX($AR$8:$AR$27))","v":""},{"$f":"IF(AV8=\"\",\"\",IF($AJ$20=\"\",0,$AJ$20))","v":""},null,{"$f":"IF(AZ8=\"\",\"\",IF($AO9=\"\",\"\",NORMDIST($AO9-$AJ$11,$O$6,$AJ$12,0)))","v":""},{"$f":"IF(AO9=\"\",\"\",IF(AZ7>99.98,\"\",NORMDIST(AO8,$O$6,$AJ$12,1)*100))","v":""}]
[null,null,"Anderson Darling",null,null,{"$f":"IF(AJ6>5,\"OK\",\"NG\")","v":"OK"},null,{"$f":"IF(Values!B53=\"\",\"\",IF(O6=\"\",\"\",IF(MAX(G109:G112)>C114,\"OK\",\"NG\")))","v":""},null,null,null,null,null,null,null,null,null,null,null,null,null,{"$f":"IF(W9=\"\",\"\",V8+1)","v":""},{"$f":"IF(Values!C5=\"\",\"\",Values!C5)","v":""},null,{"$f":"IF(W9=\"\",\"\",MAX(W8:W9)-MIN(W8:W9))","v":""},{"$f":"IF($Z$8=\"\",\"\",$Z$8)","v":""},{"$f":"IF($AA$8=\"\",\"\",$AA$8)","v":""},{"$f":"IF($AJ$16=\"\",\"\",$AJ$16)","v":""},{"$f":"IF($AJ$17=\"\",\"\",$AJ$17)","v":""},{"$f":"IF(W9=\"\",\"\",Calculation!$S$12)","v":""},{"$f":"IF(W9=\"\",\"\",Calculation!$S$13)","v":""},{"$f":"IF(W9=\"\",\"\",Calculation!$O$17)","v":""},{"$f":"IF($AJ$20=\"\",\"\",$AJ$20)","v":""},null,"Range:",{"$f":"IF(W8=\"\",\"\",AJ7-AJ8)","v":""},null,null,null,null,{"$f":"IF(Values!$B$53=\"\",\"\",AO8+$AJ$11)","v":""},{"$f":"IF(AO9=\"\",\"\",IF(OR(COUNT($W$8:$W$57)=AP8,AP8=\"\"),\"\",FREQUENCY($W$8:$W$57,AO9)))","v":""},{"$f":"IF(AP9=\"\",\"\",AP9-AP8)","v":""},{"$f":"IF(AQ9=\"\",\"\",(100/(SUM($AQ$8:$AQ$27))*AQ9))","v":""},{"$f":"IF(AQ9=\"\",\"\",AS8+AR9)","v":""},{"$f":"IF(AS9=\"\",\"\",$AJ$16)","v":""},{"$f":"IF(AS9=\"\",\"\",$AJ$17)","v":""},{"$f":"IF(AP9=\"\",\"\",MAX($AR$8:$AR$27))","v":""},{"$f":"IF(AV9=\"\",\"\",IF($AJ$20=\"\",0,$AJ$20))","v":""},null,"",{"$f":"IF(AO10=\"\",\"\",IF(AZ8>99.98,\"\",NORMDIST(AO9,$O$6,$AJ$12,1)*100))","v":""}]
[null,null,null,null,null,null,null,null,null,null,null,null,null,null,null,null,null,null,null,null,null,{"$f":"IF(W10=\"\",\"\",V9+1)","v":""},{"$f":"IF(Values!C6=\"\",\"\",Values!C6)","v":""},null,"",{"$f":"IF($Z$8=\"\",\"\",$Z$8)","v":""},{"$f":"IF($AA$8=\"\",\"\",$AA$8)","v":""},"","",{"$f":"IF(W10=\"\",\"\",Calculation!$S$12)","v":""},{"$f":"IF(W10=\"\",\"\",Calculation!$S$13)","v":""},{"$f":"IF(W10=\"\",\"\",Calculation!$O$17)","v":""},"",null,"Number of classes: ",{"$f":"IF(W8=\"\",\"\",IF(ROUNDUP(AJ6^(1/2),0)>20,20,ROUNDUP(AJ6^(1/2),0))+3)+1","v":{"$error":"#VALUE!"}},null,null,null,null,{"$f":"IF(Values!$B$53=\"\",\"\",AO9+$AJ$11)","v":""},{"$f":"IF(AO10=\"\",\"\",IF(OR(COUNT($W$8:$W$57)=AP9,AP9=\"\"),\"\",FREQUENCY($W$8:$W$57,AO10)))","v":""},"","",{"$f":"IF(AQ10=\"\",\"\",AS9+AR10)","v":""},"","","","",null,"",""]
[null,null,"Chi square",null,null,{"$f":"IF(AJ6>25,\"OK\",\"NG\")","v":"OK"},null,{"$f":"IF(Values!B53=\"\",\"\",IF(O6=\"\",\"\",IF(C124>F124,\"OK\",\"NG\")))","v":""},null,null,"Overall result",null,null,"n","d2","d3",null,"Limits",null,null,null,"",{"$f":"IF(Values!C7=\"\",\"\",Values!C7)","v":""},null,"","","","","",{"$f":"IF(W11=\"\",\"\",Calculation!$S$12)","v":""},{"$f":"IF(W11=\"\",\"\",Calculation!$S$13)","v":""},{"$f":"IF(W11=\"\",\"\",Calculation!$O$17)","v":""},"",null,"Width of classes:",{"$f":"IF(W8=\"\",\"\",AJ9/(AJ10-3))","v":""},null,null,null,null,{"$f":"IF(Values!$B$53=\"\",\"\",AO10+$AJ$11)","v":""},"","","","","","","","",null,"",""]
[null,null,null,null,null,null,null,null,null,null,null,null,null,1,1.1279999999999999,null,null,"I - UEL",{"$f":"IF(O6=\"\",\"\",$O$6+(3*$R$6)/O12)","v":""},null,null,"",{"$f":"IF(Values!C8=\"\",\"\",Values!C8)","v":""},null,"","","","","",{"$f":"IF(W12=\"\",\"\",Calculation!$S$12)","v":""},{"$f":"IF(W12=\"\",\"\",Calculation!$S$13)","v":""},{"$f":"IF(W12=\"\",\"\",Calculation!$O$17)","v":""},"",null,"Sigma",{"$f":"IF(AJ9=0,0,IF(Values!$B$53=\"\",\"\",_xlfn.STDEV.S(W8:W57)))","v":""},null,null,null,null,{"$f":"IF(Values!$B$53=\"\",\"\",AO11+$AJ$11)","v":""},"","","","","","","","",null,"",""]
[null,null,"Shapirov Wilks",null,null,"OK",null,{"$f":"IF(Values!B53=\"\",\"\",IF(O6=\"\",\"\",IF(H183>H177,\"NG\",\"OK\")))","v":""},null,null,{"$f":"IFERROR(VLOOKUP(\"OK\",H9:H16,1,FALSE),\"NG\")","v":"NG"},null,null,2,null,0.85250000000000004,null,"I - LEL",{"$f":"IF(O6=\"\",\"\",$O$6-(3*$R$6)/O12)","v":""},null,null,"",{"$f":"IF(Values!C9=\"\",\"\",Values!C9)","v":""},null,"","","","","",{"$f":"IF(W13=\"\",\"\",Calculation!$S$12)","v":""},{"$f":"IF(W13=\"\",\"\",Calculation!$S$13)","v":""},{"$f":"IF(W13=\"\",\"\",Calculation!$O$17)","v":""},"",null,null,null,null,null,null,null,{"$f":"IF(Values!$B$53=\"\",\"\",AO12+$AJ$11)","v":""},"","","","","","","","",null,"",""]
[null,null,null,null,null,null,null,null,null,null,null,null,null,null,null,null,null,null,null,null,null,"",{"$f":"IF(Values!C10=\"\",\"\",Values!C10)","v":""},null,"","","","","",{"$f":"IF(W14=\"\",\"\",Calculation!$S$12)","v":""},{"$f":"IF(W14=\"\",\"\",Calculation!$S$13)","v":""},{"$f":"IF(W14=\"\",\"\",Calculation!$O$17)","v":""},"",null,null,null,null,null,null,null,{"$f":"IF(Values!$B$53=\"\",\"\",AO13+$AJ$11)","v":""},"","","","","","","","",null,"",""]
[null,null,"Manual decision",null,null,null,null,{"$f":"IF(C21=\"\",\"None\",\"OK\")","v":"None"},null,null,null,null,null,null,null,null,null,null,null,null,null,"",{"$f":"IF(Values!C11=\"\",\"\",Values!C11)","v":""},null,"","","","","",{"$f":"IF(W15=\"\",\"\",Calculation!$S$12)","v":""},{"$f":"IF(W15=\"\",\"\",Calculation!$S$13)","v":""},{"$f":"IF(W15=\"\",\"\",Calculation!$O$17)","v":""},"",null,null,null,null,null,null,null,{"$f":"IF(Values!$B$53=\"\",\"\",AO14+$AJ$11)","v":""},"","","","","","","","",null,"",""]
[null,null,null,null,null,null,null,null,null,null,null,null,null,"Limits",null,null,null,null,null,null,null,"",{"$f":"IF(Values!C12=\"\",\"\",Values!C12)","v":""},null,"","","","","",{"$f":"IF(W16=\"\",\"\",Calculation!$S$12)","v":""},{"$f":"IF(W16=\"\",\"\",Calculation!$S$13)","v":""},{"$f":"IF(W16=\"\",\"\",Calculation!$O$17)","v":""},"",null,"USL",{"$f":"AJ52","v":""},null,null,null,null,{"$f":"IF(Values!$B$53=\"\",\"\",AO15+$AJ$11)","v":""},"","","","","","","","",null,"",""]
[null,null,null,null,null,null,null,null,null,null,null,null,null,"MR - UEL",{"$f":"IF(O6=\"\",\"\",O12*R7+3*P13*R7)","v":""},null,null,null,null,null,null,"",{"$f":"IF(Values!C13=\"\",\"\",Values!C13)","v":""},null,"","","","","",{"$f":"IF(W17=\"\",\"\",Calculation!$S$12)","v":""},{"$f":"IF(W17=\"\",\"\",Calculation!$S$13)","v":""},{"$f":"IF(W17=\"\",\"\",Calculation!$O$17)","v":""},"",null,"LSL",{"$f":"IF(Visualization!F21=\"One side is limited\",0,AJ53)","v":""},null,null,null,null,{"$f":"IF(Values!$B$53=\"\",\"\",AO16+$AJ$11)","v":""},"","","","","","","","",null,"",""]
[null,null,null,null,null,null,null,null,null,null,null,null,null,null,null,null,null,null,null,null,null,"",{"$f":"IF(Values!C14=\"\",\"\",Values!C14)","v":""},null,"","","","","",{"$f":"IF(W18=\"\",\"\",Calculation!$S$12)","v":""},{"$f":"IF(W18=\"\",\"\",Calculation!$S$13)","v":""},{"$f":"IF(W18=\"\",\"\",Calculation!$O$17)","v":""},"",null,"Delta T",{"$f":"IF(Visualization!F21=\"One side is limited\",AJ16,AJ16-AJ17)","v":{"$error":"#VALUE!"}},null,null,null,null,{"$f":"IF(Values!$B$53=\"\",\"\",AO17+$AJ$11)","v":""},{"$f":"IF(AO18=\"\",\"\",IF(OR(COUNT($W$8:$W$57)=AP17,AP17=\"\"),\"\",FREQUENCY($W$8:$W$57,AO18)))","v":""},"","","","","","","",null,"",""]
[null,null,"The decision which test of normalety will be done is handelt by the Worksheet itselfe. Factors of the decision is the amount of measurements. The user can switch manual decicion to \"OK\" !  But ist necessary to fill in the reason below.",null,null,null,null,null,null,null,null,null,null,null,null,null,null,null,null,null,null,"",{"$f":"IF(Values!C15=\"\",\"\",Values!C15)","v":""},null,"","","","","",{"$f":"IF(W19=\"\",\"\",Calculation!$S$12)","v":""},{"$f":"IF(W19=\"\",\"\",Calculation!$S$13)","v":""},{"$f":"IF(W19=\"\",\"\",Calculation!$O$17)","v":""},"",null,null,null,null,null,null,null,{"$f":"IF(Values!$B$53=\"\",\"\",AO18+$AJ$11)","v":""},{"$f":"IF(AO19=\"\",\"\",IF(OR(COUNT($W$8:$W$57)=AP18,AP18=\"\"),\"\",FREQUENCY($W$8:$W$57,AO19)))","v":""},"","","","","","","",null,"",""]
[null,null,null,null,null,null,null,null,null,null,null,null,null,null,null,null,null,null,null,null,null,"",{"$f":"IF(Values!C16=\"\",\"\",Values!C16)","v":""},null,"","","","","",{"$f":"IF(W20=\"\",\"\",Calculation!$S$12)","v":""},{"$f":"IF(W20=\"\",\"\",Calculation!$S$13)","v":""},{"$f":"IF(W20=\"\",\"\",Calculation!$O$17)","v":""},"",null,"Real Value",{"$f":"AJ51","v":""},null,null,null,null,{"$f":"IF(Values!$B$53=\"\",\"\",AO19+$AJ$11)","v":""},"","","","","","","","",null,"",""]
{"$rows_left_out":197}
{"sheet":"Settings","index":5,"n_rows":26,"n_cols":8,"rows_kept":26,"cut":false,"hidden":true,"merged":[[13,7,14,10],[6,7,8,13],[7,1,7,2],[7,3,7,5],[25,7,26,10],[25,11,26,13],[16,1,16,5],[17,4,18,5],[19,4,19,5],[21,7,22,10],[21,11,22,13],[23,7,24,10],[23,11,24,13],[22,1,22,3],[19,7,20,10],[19,11,20,13]]}
[]
[]
[]
[]
[]
[]
[null,null,null,null,null,null,null,"The integrated macros in this Worksheet are not required for the calculation. The macros just handle the scaling of the integrated charts. If you do not activate the macros, the sheet is still capable to calculate trustwothy indicies."]
[null,"Scale on",null,"Values"]
[]
[]
[]
[]
[]
[null,null,null,null,null,null,null,"Print a pdf of the register \"Visualization\" to a folder of your choice."]
[]
[]
[null,"Scale on Values"]
[null,null,"Upper","Lower","Scale-Factor \n(Standart = 0,3)"]
[null,"Max/Min",{"$f":"Calculation!AJ7","v":""},{"$f":"Calculation!AJ8","v":""}]
[null,"Scale on",{"$f":"IF(C19=\"\",\"\",C19+(C19-D19)*E20)","v":""},{"$f":"IF(D19=\"\",\"\",D19-(C19-D19)*E20)","v":""},0.3,null,null,"Guide (A \"How to\" handle the document)"]
{"$rows_left_out":7}
{"sheet":"Directories","index":6,"n_rows":18,"n_cols":6,"rows_kept":18,"cut":false,"hidden":true,"merged":[]}
[]
[]
[]
[null,"Resolution",null,"Unit",null,"Measurement system"]
[null,1,null,"µm",null,"Height Gauge"]
[null,0.5,null,"mm",null,"Precision scale"]
[null,0.1,null,"m",null,"Packing scale"]
[null,0.05,null,"Nm",null,"Flux measurment"]
[null,0.01,null,"A",null,"Final Test"]
[null,5.0000000000000001E-3,null,"mA",null,"Noise chamber"]
[null,1E-3,null,"V",null,"Vibration sensor"]
[null,5.0000000000000001E-4,null,"Pa/s",null,"LDV"]
[null,1E-4,null,"µVs",null,"AOI Grease"]
[null,5.0000000000000002E-5,null,"bar",null,"AOI Soldering"]
[null,1.0000000000000001E-5,null,"mg"]
[null,null,null,"g"]
[null,null,null,"%"]
[null,null,null,"Pixel"]

{"sheet":"References","index":7,"n_rows":13,"n_cols":2,"rows_kept":13,"cut":false,"hidden":true,"merged":[[3,1,8,9],[12,1,13,7]]}
[]
[]
[]
[null,"Calculation according \"Measurement System Capability\" Reference Manual.\n\nHead of work group:\nDr. Edgar Dietrich\n\n(Status: 17. September 2002)"]
[]
[]
[]
[]
[]
[]
[]
[]
[null,"Detailed references and calculation information are located in the Managment System doc-nr. 1758."]