{"text_format":"1","workbook":"xlsx","n_sheets":7,"sheets":["Guide","Visualization","Graphics","Calculation","Macro","References","Directories"],"not_rendered":{"charts":12,"images":17,"macros":1,"external_links":0,"defined_names":21,"comments":0,"pivot_tables":0},"unopened":[],"bounds":{"document_bytes":16777216,"sheet_cells":100000,"rows_first":2000,"rows_last":500,"rows_between":2000,"halvings":0,"cell_chars":16384,"cell_head_chars":4096},"cells_cut":0,"cells_raw":0,"read":"whole","date_system":"1900"}

{"sheet":"Guide","index":0,"n_rows":194,"n_cols":7,"rows_kept":194,"cut":false,"hidden":false,"merged":[[48,2,49,7],[6,2,7,8],[14,4,14,6],[15,4,15,6],[16,4,16,6],[30,3,31,7],[12,2,12,7],[32,3,33,7],[34,3,37,7],[38,3,39,7],[40,3,41,7],[42,3,42,7],[193,1,194,7],[50,2,50,7],[51,2,51,7],[111,1,111,2],[111,3,111,7],[157,1,158,7],[73,2,74,7],[153,1,153,6],[162,6,164,8],[147,1,147,2],[147,3,147,7],[148,1,148,2],[148,3,148,7],[112,1,112,2],[112,3,112,7],[52,2,53,7]]}
[]
[]
[]
[]
[]
[]
[null,"Important:","This file based on a Office 2010 version. For correct visualization and calculation use \nOffice 2010 or higher."]
[]
[]
[]
[]
[]
[null,"Information:","For a better understanding, which cell you can edit, the cells are colored."]
[]
[null,null,null,"<<","You can/have to edit the cell"]
[null,null,null,"<<","The cell calculate a value"]
[null,null,null,"<<","Fix data/information"]
[]
[]
[]
[]
[null,"1.1 Open register \"Visualization\""]
[]
[]
[]
[]
[]
[]
[]
[]
{"$rows_left_out":165}
{"sheet":"Visualization","index":1,"n_rows":59,"n_cols":17,"rows_kept":59,"cut":false,"hidden":false,"merged":[[15,2,15,3],[15,6,15,9],[18,3,18,4],[21,7,21,8],[22,7,22,8],[23,7,23,8],[24,7,24,8],[25,7,25,8],[26,7,26,8],[19,3,19,4],[20,3,20,4],[21,3,21,4],[22,3,22,4],[23,3,23,4],[20,5,20,6],[18,5,18,6],[18,7,18,8],[46,5,46,6],[46,7,46,8],[22,11,22,12],[23,11,23,12],[21,5,21,6],[22,5,22,6],[27,7,27,8],[18,11,18,12],[45,7,45,8],[45,5,45,6],[20,7,20,8],[56,2,56,3],[55,2,55,3],[55,4,55,5],[55,9,55,10],[54,9,54,10],[50,5,50,6],[50,2,50,4],[47,5,47,6],[55,6,55,8],[54,6,54,7],[52,2,52,3],[52,6,52,8],[52,4,52,5],[48,7,48,8],[49,7,49,8],[48,10,48,11],[49,10,49,11],[48,2,48,4],[49,2,49,4],[47,2,47,4],[48,5,48,6],[49,5,49,6],[47,10,47,11],[24,13,24,14],[18,13,18,14],[0,0,0,15],[25,5,25,6],[26,5,26,6],[27,5,27,6],[28,5,28,6],[23,5,23,6],[24,5,24,6],[6,2,6,5],[7,2,7,5],[8,2,8,5],[9,2,9,5],[10,2,10,5],[11,2,11,5],[6,6,6,10],[7,6,7,10],[8,6,8,10],[11,6,11,7],[10,6,10,7],[9,6,9,7],[13,4,13,11],[28,3,28,4],[19,7,19,8],[52,12,52,13],[24,3,24,4],[25,3,25,4],[26,3,26,4],[27,3,27,4],[19,5,19,6],[25,13,25,14],[26,13,26,14],[27,13,27,14],[28,13,28,14],[19,13,19,14],[20,13,20,14],[21,13,21,14],[22,13,22,14],[23,13,23,14],[19,11,19,12],[20,11,20,12],[21,11,21,12],[46,13,46,14],[46,2,46,4],[28,7,28,8],[47,13,47,14],[46,10,46,11],[47,7,47,8],[55,12,55,14],[14,2,14,3],[14,8,14,9],[14,10,14,11],[24,9,24,10],[25,9,25,10],[26,9,26,10],[27,9,27,10],[28,9,28,10],[19,9,19,10],[20,9,20,10],[21,9,21,10],[22,9,22,10],[23,9,23,10],[48,13,48,14],[49,13,49,14],[24,11,24,12],[25,11,25,12],[26,11,26,12],[27,11,27,12],[28,11,28,12],[14,4,14,5],[15,10,15,11],[18,9,18,10]]}
["Please enter the collected measured values into the register \"Calculation\""]
[{"$f":"IF($M$56=\"NG\",1,0)","v":0},0,0,0,0,0,0,0,0,0,0,0,0,0,0,0,0]
[{"$f":"IF($M$56=\"NG\",1,0)","v":0},null,null,null,null,null,null,null,null,null,null,null,null,null,null,null,{"$f":"IF($M$56=\"NG\",1,0)","v":0}]
[0,null,null,null,null,null,null,null,null,null,null,null,null,null,null,null,0]
[0,null,null,null,null,null,null,null,null,null,null,null,null,null,null,null,0]
[0,null,null,null,null,null,null,null,null,null,null,null,null,null,null,null,0]
[0,null,"Location:",null,null,null,null,null,null,null,null,null,null,null,null,null,0]
[0,null,"Line:",null,null,null,null,null,null,null,null,null,null,null,null,null,0]
[0,null,"Device-Type:",null,null,null,null,null,null,null,null,null,null,null,null,null,0]
[0,null,"Device-Number:",null,null,null,null,null,null,null,null,null,null,null,null,null,0]
[0,null,"Resolution:",null,null,null,null,null,null,null,null,null,null,null,null,null,0]
[0,null,"Date:",null,null,null,null,null,null,null,null,null,null,null,null,null,0]
[0,null,null,null,null,null,null,null,null,null,null,null,null,null,null,null,{"$f":"IF($M$56=\"NG\",1,0)","v":0}]
[0,null,"Feature",null,null,null,null,null,null,null,null,null,null,null,null,null,0]
[0,null,"Unit",null,null,null,null,null,"∆ Spec",null,null,null,null,null,null,null,0]
[0,null,"KPC",null,null,null,{"$f":"IF(OR(E16<>\"\",F16<>\"\"),\" Feature is critical\",\" No KPC feature\")","v":" No KPC feature"},null,null,null,{"$f":"K15","v":0},null,null,null,null,null,0]
[0,null,null,null,null,null,null,null,null,null,null,null,null,null,null,null,0]
[0,null,null,null,null,null,null,null,null,null,null,null,null,null,null,null,0]
[0,null,null,"Row A",null,"Row B",null,"Row A",null,"Row B",null,"Row A",null,"Row B",null,null,0]
[0,null,1,{"$f":"IF(Calculation!C7=\"\",\"\",FIXED(Calculation!C7,LEN($G$11)-2,FALSE))","v":""},null,{"$f":"IF(Calculation!D7=\"\",\"\",FIXED(Calculation!D7,LEN($G$11)-2,FALSE))","v":""},null,{"$f":"IF(Calculation!E7=\"\",\"\",FIXED(Calculation!E7,LEN($G$11)-2,FALSE))","v":""},null,{"$f":"IF(Calculation!F7=\"\",\"\",FIXED(Calculation!F7,LEN($G$11)-2,FALSE))","v":""},null,{"$f":"IF(Calculation!G7=\"\",\"\",FIXED(Calculation!G7,LEN($G$11)-2,FALSE))","v":""},null,{"$f":"IF(Calculation!H7=\"\",\"\",FIXED(Calculation!H7,LEN($G$11)-2,FALSE))","v":""},null,null,0]
[0,null,2,{"$f":"IF(Calculation!C8=\"\",\"\",FIXED(Calculation!C8,LEN($G$11)-2,FALSE))","v":""},null,{"$f":"IF(Calculation!D8=\"\",\"\",FIXED(Calculation!D8,LEN($G$11)-2,FALSE))","v":""},null,{"$f":"IF(Calculation!E8=\"\",\"\",FIXED(Calculation!E8,LEN($G$11)-2,FALSE))","v":""},null,{"$f":"IF(Calculation!F8=\"\",\"\",FIXED(Calculation!F8,LEN($G$11)-2,FALSE))","v":""},null,{"$f":"IF(Calculation!G8=\"\",\"\",FIXED(Calculation!G8,LEN($G$11)-2,FALSE))","v":""},null,{"$f":"IF(Calculation!H8=\"\",\"\",FIXED(Calculation!H8,LEN($G$11)-2,FALSE))","v":""},null,null,0]
[0,null,3,{"$f":"IF(Calculation!C9=\"\",\"\",FIXED(Calculation!C9,LEN($G$11)-2,FALSE))","v":""},null,{"$f":"IF(Calculation!D9=\"\",\"\",FIXED(Calculation!D9,LEN($G$11)-2,FALSE))","v":""},null,{"$f":"IF(Calculation!E9=\"\",\"\",FIXED(Calculation!E9,LEN($G$11)-2,FALSE))","v":""},null,{"$f":"IF(Calculation!F9=\"\",\"\",FIXED(Calculation!F9,LEN($G$11)-2,FALSE))","v":""},null,{"$f":"IF(Calculation!G9=\"\",\"\",FIXED(Calculation!G9,LEN($G$11)-2,FALSE))","v":""},null,{"$f":"IF(Calculation!H9=\"\",\"\",FIXED(Calculation!H9,LEN($G$11)-2,FALSE))","v":""},null,null,{"$f":"IF($M$56=\"NG\",1,0)","v":0}]
[0,null,4,{"$f":"IF(Calculation!C10=\"\",\"\",FIXED(Calculation!C10,LEN($G$11)-2,FALSE))","v":""},null,{"$f":"IF(Calculation!D10=\"\",\"\",FIXED(Calculation!D10,LEN($G$11)-2,FALSE))","v":""},null,{"$f":"IF(Calculation!E10=\"\",\"\",FIXED(Calculation!E10,LEN($G$11)-2,FALSE))","v":""},null,{"$f":"IF(Calculation!F10=\"\",\"\",FIXED(Calculation!F10,LEN($G$11)-2,FALSE))","v":""},null,{"$f":"IF(Calculation!G10=\"\",\"\",FIXED(Calculation!G10,LEN($G$11)-2,FALSE))","v":""},null,{"$f":"IF(Calculation!H10=\"\",\"\",FIXED(Calculation!H10,LEN($G$11)-2,FALSE))","v":""},null,null,0]
[0,null,5,{"$f":"IF(Calculation!C11=\"\",\"\",FIXED(Calculation!C11,LEN($G$11)-2,FALSE))","v":""},null,{"$f":"IF(Calculation!D11=\"\",\"\",FIXED(Calculation!D11,LEN($G$11)-2,FALSE))","v":""},null,{"$f":"IF(Calculation!E11=\"\",\"\",FIXED(Calculation!E11,LEN($G$11)-2,FALSE))","v":""},null,{"$f":"IF(Calculation!F11=\"\",\"\",FIXED(Calculation!F11,LEN($G$11)-2,FALSE))","v":""},null,{"$f":"IF(Calculation!G11=\"\",\"\",FIXED(Calculation!G11,LEN($G$11)-2,FALSE))","v":""},null,{"$f":"IF(Calculation!H11=\"\",\"\",FIXED(Calculation!H11,LEN($G$11)-2,FALSE))","v":""},null,null,0]
[0,null,6,{"$f":"IF(Calculation!C12=\"\",\"\",FIXED(Calculation!C12,LEN($G$11)-2,FALSE))","v":""},null,{"$f":"IF(Calculation!D12=\"\",\"\",FIXED(Calculation!D12,LEN($G$11)-2,FALSE))","v":""},null,{"$f":"IF(Calculation!E12=\"\",\"\",FIXED(Calculation!E12,LEN($G$11)-2,FALSE))","v":""},null,{"$f":"IF(Calculation!F12=\"\",\"\",FIXED(Calculation!F12,LEN($G$11)-2,FALSE))","v":""},null,{"$f":"IF(Calculation!G12=\"\",\"\",FIXED(Calculation!G12,LEN($G$11)-2,FALSE))","v":""},null,{"$f":"IF(Calculation!H12=\"\",\"\",FIXED(Calculation!H12,LEN($G$11)-2,FALSE))","v":""},null,null,0]
[0,null,7,{"$f":"IF(Calculation!C13=\"\",\"\",FIXED(Calculation!C13,LEN($G$11)-2,FALSE))","v":""},null,{"$f":"IF(Calculation!D13=\"\",\"\",FIXED(Calculation!D13,LEN($G$11)-2,FALSE))","v":""},null,{"$f":"IF(Calculation!E13=\"\",\"\",FIXED(Calculation!E13,LEN($G$11)-2,FALSE))","v":""},null,{"$f":"IF(Calculation!F13=\"\",\"\",FIXED(Calculation!F13,LEN($G$11)-2,FALSE))","v":""},null,{"$f":"IF(Calculation!G13=\"\",\"\",FIXED(Calculation!G13,LEN($G$11)-2,FALSE))","v":""},null,{"$f":"IF(Calculation!H13=\"\",\"\",FIXED(Calculation!H13,LEN($G$11)-2,FALSE))","v":""},null,null,0]
[0,null,8,{"$f":"IF(Calculation!C14=\"\",\"\",FIXED(Calculation!C14,LEN($G$11)-2,FALSE))","v":""},null,{"$f":"IF(Calculation!D14=\"\",\"\",FIXED(Calculation!D14,LEN($G$11)-2,FALSE))","v":""},null,{"$f":"IF(Calculation!E14=\"\",\"\",FIXED(Calculation!E14,LEN($G$11)-2,FALSE))","v":""},null,{"$f":"IF(Calculation!F14=\"\",\"\",FIXED(Calculation!F14,LEN($G$11)-2,FALSE))","v":""},null,{"$f":"IF(Calculation!G14=\"\",\"\",FIXED(Calculation!G14,LEN($G$11)-2,FALSE))","v":""},null,{"$f":"IF(Calculation!H14=\"\",\"\",FIXED(Calculation!H14,LEN($G$11)-2,FALSE))","v":""},null,null,0]
[0,null,9,{"$f":"IF(Calculation!C15=\"\",\"\",FIXED(Calculation!C15,LEN($G$11)-2,FALSE))","v":""},null,{"$f":"IF(Calculation!D15=\"\",\"\",FIXED(Calculation!D15,LEN($G$11)-2,FALSE))","v":""},null,{"$f":"IF(Calculation!E15=\"\",\"\",FIXED(Calculation!E15,LEN($G$11)-2,FALSE))","v":""},null,{"$f":"IF(Calculation!F15=\"\",\"\",FIXED(Calculation!F15,LEN($G$11)-2,FALSE))","v":""},null,{"$f":"IF(Calculation!G15=\"\",\"\",FIXED(Calculation!G15,LEN($G$11)-2,FALSE))","v":""},null,{"$f":"IF(Calculation!H15=\"\",\"\",FIXED(Calculation!H15,LEN($G$11)-2,FALSE))","v":""},null,null,0]
[0,null,10,{"$f":"IF(Calculation!C16=\"\",\"\",FIXED(Calculation!C16,LEN($G$11)-2,FALSE))","v":""},null,{"$f":"IF(Calculation!D16=\"\",\"\",FIXED(Calculation!D16,LEN($G$11)-2,FALSE))","v":""},null,{"$f":"IF(Calculation!E16=\"\",\"\",FIXED(Calculation!E16,LEN($G$11)-2,FALSE))","v":""},null,{"$f":"IF(Calculation!F16=\"\",\"\",FIXED(Calculation!F16,LEN($G$11)-2,FALSE))","v":""},null,{"$f":"IF(Calculation!G16=\"\",\"\",FIXED(Calculation!G16,LEN($G$11)-2,FALSE))","v":""},null,{"$f":"IF(Calculation!H16=\"\",\"\",FIXED(Calculation!H16,LEN($G$11)-2,FALSE))","v":""},null,null,0]
[0,null,null,null,null,null,null,null,null,null,null,null,null,null,null,null,0]
{"$rows_left_out":30}
{"sheet":"Graphics","index":2,"n_rows":88,"n_cols":28,"rows_kept":88,"cut":false,"hidden":false,"merged":[[50,18,50,21],[51,19,51,21],[52,19,52,21],[68,19,68,21]]}
[]
[]
[]
[]
[]
[]
[]
[]
[]
[]
[]
[]
[]
[]
[]
[]
[]
[]
[]
[]
[]
[]
[]
[]
[]
[]
[]
[]
[]
[]
{"$rows_left_out":59}
{"sheet":"Calculation","index":3,"n_rows":66,"n_cols":30,"rows_kept":66,"cut":false,"hidden":false,"merged":[[32,14,33,14],[32,15,33,15],[32,16,33,16],[32,17,33,17],[32,13,33,13],[42,34,42,36],[25,3,25,4],[26,1,27,2],[26,3,27,4],[23,1,23,2],[23,3,23,4],[34,34,34,36],[36,9,36,10],[38,9,38,10],[38,1,38,2],[41,1,41,2],[33,1,33,2],[34,1,34,2],[35,1,35,2],[36,1,36,2],[37,1,37,2],[24,1,24,2],[24,3,24,4],[25,1,25,2],[18,8,18,13],[19,2,19,3],[19,4,19,5],[19,6,19,7],[19,8,19,9],[19,10,19,11],[19,12,19,13],[4,1,5,1],[2,23,3,25],[2,26,3,29],[2,22,4,22],[2,21,4,21],[2,20,4,20],[4,2,4,3],[4,4,4,5],[4,6,4,7],[4,36,4,37],[6,8,6,9],[6,10,6,11],[6,12,6,13],[8,8,8,9],[8,10,8,11],[8,12,8,13],[7,8,7,9],[7,10,7,11],[7,12,7,13],[2,19,4,19],[4,10,4,13],[32,6,33,6],[40,9,41,10],[40,11,41,11],[37,9,37,10],[4,34,4,35],[12,10,12,11],[12,12,12,13],[11,8,11,9],[11,10,11,11],[11,12,11,13],[14,8,14,9],[14,10,14,11],[14,12,14,13],[13,8,13,9],[13,10,13,11],[13,12,13,13],[32,11,33,11],[32,12,33,12],[34,9,34,10],[35,9,35,10],[32,7,33,7],[9,12,9,13],[12,8,12,9],[15,8,15,9],[15,10,15,11],[15,12,15,13],[10,8,10,9],[10,10,10,11],[10,12,10,13],[17,2,17,7],[18,2,18,4],[18,5,18,7],[9,8,9,9],[9,10,9,11],[47,1,47,2],[48,2,48,3],[49,2,49,3],[50,2,50,3],[51,2,51,3]]}
[]
[]
[null,null,null,null,null,null,null,null,null,null,null,null,null,null,null,null,null,null,null,"Values","i","j","r","X-Bar",null,null,"Sigma"]
[]
[null,"i","j = 1 (Inspector A)",null,"j = 2 (Inspector B)",null,"j = 3 (Inspector C)",null,null,null,null,null,null,null,null,null,null,null,null,null,null,null,null,"Part (i)","Inspector (j)","Repeatability","Part (i)","Inspector (j)","Repeatability","TOTAL"]
[null,null,"m = 1 (Row A)","m =  2 (Row B)","m = 1 (Row A)","m =  2 (Row B)","m = 1 (Row A)","m =  2 (Row B)",null,null,null,null,null,null,null,null,null,null,null,{"$f":"IF(VLOOKUP(U6,$B$7:$H$16,2)=\"\",\"\",VLOOKUP(U6,$B$7:$H$16,2))","v":""},1,1,1,{"$f":"IF(T6=\"\",\"\",SUMIF($U$6:$U$65,\"=\"&U6,$T$6:$T$65)/($D$25*$D$27))","v":""},{"$f":"IF(T6=\"\",\"\",SUMIF($V$6:$V$65,\"=\"&V6,$T$6:$T$65)/($D$26*$D$27))","v":""},{"$f":"IF(T6=\"\",\"\",SUMIFS($T$6:$T$65,$U$6:$U$65,\"=\"&U6,$V$6:$V$65,\"=\"&V6)/($D$27))","v":""},{"$f":"IF(T6=\"\",\"\",(X6-$F$19)^2)","v":""},{"$f":"IF(Y6=\"\",\"\",(Y6-$F$19)^2)","v":""},{"$f":"IF(T6=\"\",\"\",(T6-Z6)^2)","v":""},{"$f":"IF(T6=\"\",\"\",(T6-$F$19)^2)","v":""}]
[null,1,null,null,null,null,null,null,null,null,null,null,null,null,null,null,null,null,null,{"$f":"IF(VLOOKUP(U7,$B$7:$H$16,3)=\"\",\"\",VLOOKUP(U7,$B$7:$H$16,3))","v":""},1,1,2,"","","",{"$f":"IF(T7=\"\",\"\",(X7-$F$19)^2)","v":""},{"$f":"IF(Y7=\"\",\"\",(Y7-$F$19)^2)","v":""},{"$f":"IF(T7=\"\",\"\",(T7-Z7)^2)","v":""},{"$f":"IF(T7=\"\",\"\",(T7-$F$19)^2)","v":""}]
[null,2,null,null,null,null,null,null,null,null,null,null,null,null,null,null,null,null,null,{"$f":"IF(VLOOKUP(U8,$B$7:$H$16,2)=\"\",\"\",VLOOKUP(U8,$B$7:$H$16,2))","v":""},2,1,1,"","","","","","",""]
[null,3,null,null,null,null,null,null,null,null,null,null,null,null,null,null,null,null,null,{"$f":"IF(VLOOKUP(U9,$B$7:$H$16,3)=\"\",\"\",VLOOKUP(U9,$B$7:$H$16,3))","v":""},2,1,2,"","","","","","",""]
[null,4,null,null,null,null,null,null,null,null,null,null,null,null,null,null,null,null,null,{"$f":"IF(VLOOKUP(U10,$B$7:$H$16,2)=\"\",\"\",VLOOKUP(U10,$B$7:$H$16,2))","v":""},3,1,1,"","","","","","",""]
[null,5,null,null,null,null,null,null,null,null,null,null,null,null,null,null,null,null,null,{"$f":"IF(VLOOKUP(U11,$B$7:$H$16,3)=\"\",\"\",VLOOKUP(U11,$B$7:$H$16,3))","v":""},3,1,2,"","","","","","",""]
[null,6,null,null,null,null,null,null,null,null,null,null,null,null,null,null,null,null,null,{"$f":"IF(VLOOKUP(U12,$B$7:$H$16,2)=\"\",\"\",VLOOKUP(U12,$B$7:$H$16,2))","v":""},4,1,1,"","","","","","",""]
[null,7,null,null,null,null,null,null,null,null,null,null,null,null,null,null,null,null,null,{"$f":"IF(VLOOKUP(U13,$B$7:$H$16,3)=\"\",\"\",VLOOKUP(U13,$B$7:$H$16,3))","v":""},4,1,2,"","","","","","",""]
[null,8,null,null,null,null,null,null,null,null,null,null,null,null,null,null,null,null,null,{"$f":"IF(VLOOKUP(U14,$B$7:$H$16,2)=\"\",\"\",VLOOKUP(U14,$B$7:$H$16,2))","v":""},5,1,1,"","","","","","",""]
[null,9,null,null,null,null,null,null,null,null,null,null,null,null,null,null,null,null,null,{"$f":"IF(VLOOKUP(U15,$B$7:$H$16,3)=\"\",\"\",VLOOKUP(U15,$B$7:$H$16,3))","v":""},5,1,2,"","","","","","",""]
[null,10,null,null,null,null,null,null,null,null,null,null,null,null,null,null,null,null,null,{"$f":"IF(VLOOKUP(U16,$B$7:$H$16,2)=\"\",\"\",VLOOKUP(U16,$B$7:$H$16,2))","v":""},6,1,1,"","","","","","",""]
[null,null,null,null,null,null,null,null,null,null,null,null,null,null,null,null,null,null,null,{"$f":"IF(VLOOKUP(U17,$B$7:$H$16,3)=\"\",\"\",VLOOKUP(U17,$B$7:$H$16,3))","v":""},6,1,2,"","","","","","",""]
[null,null,"All Inpectors",null,null,null,null,null,null,null,null,null,null,null,null,null,null,null,null,{"$f":"IF(VLOOKUP(U18,$B$7:$H$16,2)=\"\",\"\",VLOOKUP(U18,$B$7:$H$16,2))","v":""},7,1,1,"","","","","","",""]
[null,null,"X-Bar [j1j2j3]",null,null,{"$f":"IF(C7=\"\",\"\",AVERAGE(C7:H16))","v":""},null,null,null,null,null,null,null,null,null,null,null,null,null,{"$f":"IF(VLOOKUP(U19,$B$7:$H$16,3)=\"\",\"\",VLOOKUP(U19,$B$7:$H$16,3))","v":""},7,1,2,"","","","","","",""]
[null,null,null,null,null,null,null,null,null,null,null,null,null,null,null,null,null,null,null,{"$f":"IF(VLOOKUP(U20,$B$7:$H$16,2)=\"\",\"\",VLOOKUP(U20,$B$7:$H$16,2))","v":""},8,1,1,"","","","","","",""]
[null,null,null,null,null,null,null,null,null,null,null,null,null,null,null,null,null,null,null,{"$f":"IF(VLOOKUP(U21,$B$7:$H$16,3)=\"\",\"\",VLOOKUP(U21,$B$7:$H$16,3))","v":""},8,1,2,"","","","","","",""]
[null,null,null,null,null,null,null,null,null,null,null,null,null,null,null,null,null,null,null,{"$f":"IF(VLOOKUP(U22,$B$7:$H$16,2)=\"\",\"\",VLOOKUP(U22,$B$7:$H$16,2))","v":""},9,1,1,"","","","","","",""]
[null,null,null,null,null,null,null,null,null,null,null,null,null,null,null,null,null,null,null,{"$f":"IF(VLOOKUP(U23,$B$7:$H$16,3)=\"\",\"\",VLOOKUP(U23,$B$7:$H$16,3))","v":""},9,1,2,"","","","","","",""]
[null,"∆T",null,{"$f":"IF(Visualization!K15=\"\",\"No specification limits!\",Visualization!K16)","v":"No specification limits!"},null,null,null,null,null,null,null,null,null,null,null,null,null,null,null,{"$f":"IF(VLOOKUP(U24,$B$7:$H$16,2)=\"\",\"\",VLOOKUP(U24,$B$7:$H$16,2))","v":""},10,1,1,"","","","","","",""]
[null,"Inspectors (j)",null,{"$f":"IF(COUNT(C7,E7,G7)=0,\"\",COUNT(C7,E7,G7))","v":""},null,null,null,null,null,null,null,null,null,null,null,null,null,null,null,{"$f":"IF(VLOOKUP(U25,$B$7:$H$16,3)=\"\",\"\",VLOOKUP(U25,$B$7:$H$16,3))","v":""},10,1,2,"","","","","","",""]
[null,"Speciments (i)",null,{"$f":"IF(COUNT(C7:C16)=0,\"\",COUNT(C7:C16))","v":""},null,null,null,null,null,null,null,null,null,null,null,null,null,null,null,{"$f":"IF(VLOOKUP(U26,$B$7:$H$16,4)=\"\",\"\",VLOOKUP(U26,$B$7:$H$16,4))","v":""},1,2,1,"","","","","","",""]
[null,"Amount of measurements (r)",null,{"$f":"IF(COUNT(C7:D7)=0,\"\",COUNT(C7:D7))","v":""},null,null,null,null,null,null,null,null,null,null,null,null,null,null,null,{"$f":"IF(VLOOKUP(U27,$B$7:$H$16,5)=\"\",\"\",VLOOKUP(U27,$B$7:$H$16,5))","v":""},1,2,2,"","","","","","",""]
[null,null,null,null,null,null,null,null,null,null,null,null,null,null,null,null,null,null,null,{"$f":"IF(VLOOKUP(U28,$B$7:$H$16,4)=\"\",\"\",VLOOKUP(U28,$B$7:$H$16,4))","v":""},2,2,1,"","","","","","",""]
[null,null,null,null,null,null,null,null,null,null,null,null,null,null,null,null,null,null,null,{"$f":"IF(VLOOKUP(U29,$B$7:$H$16,5)=\"\",\"\",VLOOKUP(U29,$B$7:$H$16,5))","v":""},2,2,2,"","","","","","",""]
[null,null,null,null,null,null,null,null,null,null,null,null,null,null,null,null,null,null,null,{"$f":"IF(VLOOKUP(U30,$B$7:$H$16,4)=\"\",\"\",VLOOKUP(U30,$B$7:$H$16,4))","v":""},3,2,1,"","","","","","",""]
{"$rows_left_out":37}
{"sheet":"Macro","index":4,"n_rows":14,"n_cols":11,"rows_kept":14,"cut":false,"hidden":false,"merged":[[5,1,8,8],[13,4,14,5],[13,7,15,8],[13,9,15,9],[13,10,15,11],[15,4,15,5]]}
[]
[]
[]
[]
[]
[null,"The integrated macro in this Worksheet are not required for the calculation. The macro just handle an easy way to print the a .pdf of the register \"Visualization\"."]
[]
[]
[]
[]
[]
[]
[]
[null,null,null,null,null,null,null,"Export Worksheet \"Visualization\" as PDF",null,null,"The .pdf will be saved in the same folder as the excel file."]

{"sheet":"References","index":5,"n_rows":14,"n_cols":2,"rows_kept":14,"cut":false,"hidden":false,"merged":[[4,1,9,9],[13,1,15,4]]}
[]
[]
[]
[]
[null,"Calculation according \"Measurement System Capability\" Reference Manual.\n\nHead of work group:\nDr. Edgar Dietrich\n\n(Status: 17. September 2002)"]
[]
[]
[]
[]
[]
[]
[]
[]
[null,"Detailed references and calculation information are located in the Managment System doc-nr. 1785."]

{"sheet":"Directories","index":6,"n_rows":16,"n_cols":6,"rows_kept":16,"cut":false,"hidden":false,"merged":[]}
[]
[null,"Resolution","Line","Location","Unit","Measurement system"]
[null,1,null,null,"µm","Height Gauge"]
[null,0.5,null,null,"mm","Precision scale"]
[null,0.1,null,null,"m"]
[null,0.05,null,null,"Nm"]
[null,0.01,null,null,"A"]
[null,5.0000000000000001E-3,null,null,"mA"]
[null,1E-3,null,null,"V"]
[null,5.0000000000000001E-4,null,null,"Pa/s"]
[null,1E-4,null,null,"µVs"]
[null,5.0000000000000002E-5,null,null,"bar"]
[null,1.0000000000000001E-5,null,null,"mg"]
[null,null,null,null,"g"]
[null,null,null,null,"%"]
[null,null,null,null,"Pixel"]