{"text_format":"1","workbook":"xlsx","n_sheets":8,"sheets":["Guide","Visualization","Values","Graphics","Calculation","Settings","References","Directories"],"not_rendered":{"charts":6,"images":12,"macros":1,"external_links":1,"defined_names":34,"comments":1,"pivot_tables":0},"unopened":[],"bounds":{"document_bytes":16777216,"sheet_cells":100000,"rows_first":2000,"rows_last":500,"rows_between":2000,"halvings":0,"cell_chars":16384,"cell_head_chars":4096},"cells_cut":0,"cells_raw":0,"read":"whole","date_system":"1900"}

{"sheet":"Guide","index":0,"n_rows":152,"n_cols":7,"rows_kept":152,"cut":false,"hidden":true,"merged":[[29,3,32,7],[4,2,4,8],[5,1,5,8],[9,3,9,6],[25,3,26,7],[27,3,28,7],[57,2,57,7],[58,2,58,7],[59,2,60,7],[81,2,81,7],[33,3,34,7],[36,3,37,7],[35,3,35,7],[38,3,39,7],[54,2,55,7],[56,2,56,7],[247,2,249,7],[260,6,264,8],[278,1,283,8],[80,2,80,7],[130,6,132,8],[136,6,137,8],[192,6,192,8],[194,6,196,8],[200,6,202,8],[234,2,236,7],[121,6,123,8],[125,6,127,8],[114,1,114,2],[114,3,114,7],[100,1,100,2],[100,3,100,7]]}
[]
[]
[]
[]
[null,"Important:"]
[null,"This file based on an Office 2010 version. For correct visualization and calculation use Office 2010 or higher."]
[]
[null,"Information:"]
[]
[null,null,null,"If a cell is gray, a input is mandatory"]
[]
[]
[]
[]
[null,"1.1 Open register \"Visualization\""]
{"$rows_left_out":138}
{"sheet":"Visualization","index":1,"n_rows":87,"n_cols":31,"rows_kept":87,"cut":false,"hidden":false,"merged":[[22,7,22,10],[11,13,11,16],[79,2,79,8],[79,26,79,29],[21,18,21,22],[23,2,24,8],[19,7,20,14],[19,24,21,27],[19,18,19,22],[20,18,20,22],[21,16,21,17],[79,12,79,15],[78,2,78,3],[78,4,78,5],[78,6,78,8],[78,18,78,24],[21,7,21,10],[22,16,22,22],[1,2,3,17],[19,16,19,17],[20,16,20,17],[5,13,7,19],[9,17,9,19],[10,17,10,19],[8,2,9,4],[6,2,6,3],[8,5,9,11],[11,17,11,19],[12,17,12,19],[13,17,13,19],[14,17,14,19],[9,13,9,16],[14,13,14,16],[15,13,15,16],[13,5,13,11],[10,13,10,16],[15,17,15,19],[12,13,12,16],[13,13,13,16],[14,5,14,11],[10,2,10,4],[11,2,11,4],[12,2,12,4],[1,1,3,1],[21,2,21,6],[19,2,20,6],[86,0,86,32],[1,18,3,31],[78,9,78,10],[80,18,80,23],[79,18,79,19],[80,2,80,5],[80,6,80,11],[80,12,80,17],[80,26,80,29],[13,2,13,4],[14,2,14,4],[7,5,7,11],[10,5,10,11],[11,5,11,11],[12,5,12,11],[7,2,7,4]]}
[]
[null,null,"Attr(2)_Proof of fitness with reference values"]
[]
[]
[]
[null,null,null,null,null,null,null,null,null,null,null,null,null,"Feature Independent"]
[]
[null,null,"Location:"]
[null,null,"Line:"]
[null,null,null,null,null,null,null,null,null,null,null,null,null,"Base ID:"]
[null,null,"Meas. System-Name:",null,null,null,null,null,null,null,null,null,null,"Revision:"]
[null,null,"Meas. System-No.:",null,null,null,null,null,null,null,null,null,null,"Version:"]
[null,null,"Device-handling:",null,null,null,null,null,null,null,null,null,null,"Released by (ID):"]
[null,null,"Resolution:",null,null,null,null,null,null,null,null,null,null,"Released by:"]
[null,null,"Date of Datacollection:",null,null,null,null,null,null,null,null,null,null,"Date of release:"]
{"$rows_left_out":73}
{"sheet":"Values","index":2,"n_rows":54,"n_cols":12,"rows_kept":54,"cut":false,"hidden":true,"merged":[[1,1,1,2]]}
[]
[null,"Values"]
[]
[null,"Nr.","Ref. Value",{"$f":"IF($F$12=\"manuell\",\"XA1\",\"X1\")","v":"X1"},{"$f":"IF($F$12=\"manuell\",\"XA2\",\"X2\")","v":"X2"},{"$f":"IF($F$12=\"manuell\",\"XA3\",\"X3\")","v":"X3"},{"$f":"IF($F$12=\"manuell\",\"XB1\",\"X4\")","v":"X4"},{"$f":"IF($F$12=\"manuell\",\"XB2\",\"X5\")","v":"X5"},{"$f":"IF($F$12=\"manuell\",\"XB3\",\"X6\")","v":"X6"},{"$f":"IF($F$12=\"manuell\",\"XC1\",\"X7\")","v":"X7"},{"$f":"IF($F$12=\"manuell\",\"XC2\",\"X8\")","v":"X8"},{"$f":"IF($F$12=\"manuell\",\"XC3\",\"X9\")","v":"X9"}]
[null,{"$f":"IF(C5=\"\",\"\",1)","v":""}]
[null,{"$f":"IF(C6=\"\",\"\",B5+1)","v":""}]
[null,{"$f":"IF(C7=\"\",\"\",B6+1)","v":""}]
[null,""]
[null,""]
[null,""]
[null,""]
[null,""]
[null,""]
[null,""]
[null,""]
{"$rows_left_out":40}
{"sheet":"Graphics","index":3,"n_rows":0,"n_cols":0,"rows_kept":0,"cut":false,"hidden":false,"merged":[[5,17,14,17],[5,18,14,18],[15,17,15,18],[22,17,31,17],[22,18,31,18]]}

{"sheet":"Calculation","index":4,"n_rows":54,"n_cols":68,"rows_kept":54,"cut":false,"hidden":true,"merged":[[1,46,2,50],[1,1,2,7],[1,14,2,18],[21,46,21,47],[2,9,2,12],[3,47,3,48],[4,43,5,43],[6,43,7,43],[8,43,9,43],[10,43,11,43],[12,43,13,43],[40,42,40,43],[3,51,3,52],[14,44,15,44],[22,46,23,49],[3,49,3,50],[24,42,24,43]]}
[]
[null,"Values and Results",null,null,null,null,null,null,null,null,null,null,null,null,"Values and Results (Sorted)",null,null,null,null,null,null,null,null,null,null,null,null,null,null,null,null,null,null,null,null,null,null,null,null,null,null,null,null,null,null,null,"Class and Histogram calculations"]
[null,null,null,null,null,null,null,null,null,null,null,null,null,null,null,null,null,null,null,null,null,null,null,null,null,null,null,null,null,null,null,null,null,null,null,null,null,null,null,null,null,null,null,null,null,null,null,null,null,null,null,null,null,null,null,"Nr","USL","LSL","d1u","d1l","d2u","d2l","d3u","d3l","d4u","d4l","d5u","d5l"]
[null,"Rank","n","Ref. Value",{"$f":"IF($F$11=\"manuell\",\"XA1\",\"X1\")","v":"X1"},{"$f":"IF($F$11=\"manuell\",\"XA2\",\"X2\")","v":"X2"},{"$f":"IF($F$11=\"manuell\",\"XA3\",\"X3\")","v":"X3"},{"$f":"IF($F$11=\"manuell\",\"XB1\",\"X4\")","v":"X4"},{"$f":"IF($F$11=\"manuell\",\"XB2\",\"X5\")","v":"X5"},{"$f":"IF($F$11=\"manuell\",\"XB3\",\"X6\")","v":"X6"},{"$f":"IF($F$11=\"manuell\",\"XC1\",\"X7\")","v":"X7"},{"$f":"IF($F$11=\"manuell\",\"XC2\",\"X8\")","v":"X8"},{"$f":"IF($F$11=\"manuell\",\"XC3\",\"X9\")","v":"X9"},null,"n","Rank","Ref. Value",{"$f":"IF($F$11=\"manuell\",\"XA1\",\"X1\")","v":"X1"},{"$f":"IF($F$11=\"manuell\",\"XA2\",\"X2\")","v":"X2"},{"$f":"IF($F$11=\"manuell\",\"XA3\",\"X3\")","v":"X3"},{"$f":"IF($F$11=\"manuell\",\"XB1\",\"X4\")","v":"X4"},{"$f":"IF($F$11=\"manuell\",\"XB2\",\"X5\")","v":"X5"},{"$f":"IF($F$11=\"manuell\",\"XB3\",\"X6\")","v":"X6"},{"$f":"IF($F$11=\"manuell\",\"XC1\",\"X7\")","v":"X7"},{"$f":"IF($F$11=\"manuell\",\"XC2\",\"X8\")","v":"X8"},{"$f":"IF($F$11=\"manuell\",\"XC3\",\"X9\")","v":"X9"},null,null,"Green","Yellow","Red",null,null,null,null,null,null,"Rank","Result","Border values",null,"Rank","Border values","uncertainty ranges",null,null,"Classes","Values per class (Good)",null,"Values per class (Uncertain)",null,"Values per class (Bad)",null,"Sum",null,1,{"$f":"Visualization!$S$20","v":0},{"$f":"Visualization!$S$21","v":0},{"$f":"Calculation!$AQ$5","v":""},{"$f":"Calculation!$AQ$6","v":""},{"$f":"Calculation!$AQ$7","v":""},{"$f":"Calculation!$AQ$8","v":""},{"$f":"Calculation!$AQ$9","v":""},{"$f":"Calculation!$AQ$10","v":""},{"$f":"Calculation!$AQ$11","v":""},{"$f":"Calculation!$AQ$12","v":""},{"$f":"Calculation!$AQ$13","v":""},{"$f":"Calculation!$AQ$14","v":""}]
[null,{"$f":"IF(D5=\"\",\"\",RANK(D5,$D$5:$D$54))","v":""},1,{"$f":"IF(Values!C5=\"\",\"\",Values!C5)","v":""},{"$f":"IF(Values!D5=\"\",\"\",Values!D5)","v":""},{"$f":"IF(Values!E5=\"\",\"\",Values!E5)","v":""},{"$f":"IF(Values!F5=\"\",\"\",Values!F5)","v":""},{"$f":"IF(Values!G5=\"\",\"\",Values!G5)","v":""},{"$f":"IF(Values!H5=\"\",\"\",Values!H5)","v":""},{"$f":"IF(Values!I5=\"\",\"\",Values!I5)","v":""},{"$f":"IF(Values!J5=\"\",\"\",Values!J5)","v":""},{"$f":"IF(Values!K5=\"\",\"\",Values!K5)","v":""},{"$f":"IF(Values!L5=\"\",\"\",Values!L5)","v":""},null,{"$f":"IF(B5=\"\",\"\",VLOOKUP(P5,$B$5:$D$54,2,FALSE))","v":""},1,{"$f":"IF(O5=\"\",\"\",VLOOKUP(P5,$B$5:$D$54,3,FALSE))","v":""},{"$f":"IF(O5=\"\",\"\",VLOOKUP(P5,$B$5:$M$54,4,FALSE))","v":""},{"$f":"IF(O5=\"\",\"\",VLOOKUP(P5,$B$5:$M$54,5,FALSE))","v":""},{"$f":"IF(O5=\"\",\"\",VLOOKUP(P5,$B$5:$M$54,6,FALSE))","v":""},{"$f":"IF(O5=\"\",\"\",VLOOKUP(P5,$B$5:$M$54,7,FALSE))","v":""},{"$f":"IF(O5=\"\",\"\",VLOOKUP(P5,$B$5:$M$54,8,FALSE))","v":""},{"$f":"IF(O5=\"\",\"\",VLOOKUP(P5,$B$5:$M$54,9,FALSE))","v":""},{"$f":"IF(O5=\"\",\"\",VLOOKUP(P5,$B$5:$M$54,10,FALSE))","v":""},{"$f":"IF(O5=\"\",\"\",VLOOKUP(P5,$B$5:$M$54,11,FALSE))","v":""},{"$f":"IF(O5=\"\",\"\",VLOOKUP(P5,$B$5:$M$54,12,FALSE))","v":""},{"$f":"IF(AJ5=1,IF(Q5-Visualization!$S$20>Visualization!$S$21-Q5,\"USL\",\"LSL\"),\"\")","v":""},null,{"$f":"IF(COUNTIF(R5:Z5,\"OK\")=9,Q5,\"\")","v":""},{"$f":"IF(AND(COUNTIF(R5:Z5,\"OK\")<>9,COUNTIF(R5:Z5,\"NG\")<>9),Q5,\"\")","v":""},{"$f":"IF(COUNTIF(R5:Z5,\"NG\")=9,Q5,\"\")","v":""},null,{"$f":"IF(AND($AR$44>Q5,$L$4>Q6),1,0)","v":0},{"$f":"IF(AND(Q5>$AR$43,Q6>$L$3),1,0)","v":0},{"$f":"IF(AH5=AG5,1,0)","v":1},{"$f":"IF(OR(AND(AH5=0,AH4=1,AI5=1),AND(AG5=0,AG6=1,AI5=1)),1,0)","v":0},null,{"$f":"IF(AN5=\"\",\"\",RANK(AN5,$AN$5:$AN$54))","v":""},{"$f":"IF(OR(COUNTIF(R5:Z5,\"NG\")=9,COUNTIF(R5:Z5,\"OK\")=9),1,0.5)","v":0.5},{"$f":"IF(OR(AND(AM5=1,AM4=0.5),AND(AM5=1,AM6=0.5)),Q5,\"\")","v":""},null,1,{"$f":"IF(COUNTIF(AL5:AL54,AP5)=1,VLOOKUP(AP5,$AL$5:$AN$54,3,FALSE),\"\")","v":""},{"$f":"IF(AQ5=\"\",\"\",AQ5-AQ6)","v":""},null,null,{"$f":"IF(AR31=\"\",\"\",AR28-(2*AR31))","v":""},{"$f":"IF(AU5=\"\",\"\",FREQUENCY($AC$5:$AC$54,AU5))","v":""},{"$f":"AV5","v":""},{"$f":"IF(AU5=\"\",\"\",FREQUENCY($AD$5:$AD$54,AU5))","v":""},{"$f":"AX5","v":""},{"$f":"IF(AU5=\"\",\"\",FREQUENCY($AE$5:$AE$54,AU5))","v":""},{"$f":"AZ5","v":""},{"$f":"SUM((AW5,AY5,BA5))","v":0},null,2,{"$f":"Visualization!$S$20","v":0},{"$f":"Visualization!$S$21","v":0},{"$f":"Calculation!$AQ$5","v":""},{"$f":"Calculation!$AQ$6","v":""},{"$f":"Calculation!$AQ$7","v":""},{"$f":"Calculation!$AQ$8","v":""},{"$f":"Calculation!$AQ$9","v":""},{"$f":"Calculation!$AQ$10","v":""},{"$f":"Calculation!$AQ$11","v":""},{"$f":"Calculation!$AQ$12","v":""},{"$f":"Calculation!$AQ$13","v":""},{"$f":"Calculation!$AQ$14","v":""}]
[null,{"$f":"IF(D6=\"\",\"\",RANK(D6,$D$5:$D$54))","v":""},2,{"$f":"IF(Values!C6=\"\",\"\",Values!C6)","v":""},{"$f":"IF(Values!D6=\"\",\"\",Values!D6)","v":""},{"$f":"IF(Values!E6=\"\",\"\",Values!E6)","v":""},{"$f":"IF(Values!F6=\"\",\"\",Values!F6)","v":""},{"$f":"IF(Values!G6=\"\",\"\",Values!G6)","v":""},{"$f":"IF(Values!H6=\"\",\"\",Values!H6)","v":""},{"$f":"IF(Values!I6=\"\",\"\",Values!I6)","v":""},{"$f":"IF(Values!J6=\"\",\"\",Values!J6)","v":""},{"$f":"IF(Values!K6=\"\",\"\",Values!K6)","v":""},{"$f":"IF(Values!L6=\"\",\"\",Values!L6)","v":""},null,"",2,{"$f":"IF(O6=\"\",\"\",VLOOKUP(P6,$B$5:$D$54,3,FALSE))","v":""},{"$f":"IF(O6=\"\",\"\",VLOOKUP(P6,$B$5:$M$54,4,FALSE))","v":""},{"$f":"IF(O6=\"\",\"\",VLOOKUP(P6,$B$5:$M$54,5,FALSE))","v":""},{"$f":"IF(O6=\"\",\"\",VLOOKUP(P6,$B$5:$M$54,6,FALSE))","v":""},{"$f":"IF(O6=\"\",\"\",VLOOKUP(P6,$B$5:$M$54,7,FALSE))","v":""},{"$f":"IF(O6=\"\",\"\",VLOOKUP(P6,$B$5:$M$54,8,FALSE))","v":""},{"$f":"IF(O6=\"\",\"\",VLOOKUP(P6,$B$5:$M$54,9,FALSE))","v":""},{"$f":"IF(O6=\"\",\"\",VLOOKUP(P6,$B$5:$M$54,10,FALSE))","v":""},{"$f":"IF(O6=\"\",\"\",VLOOKUP(P6,$B$5:$M$54,11,FALSE))","v":""},{"$f":"IF(O6=\"\",\"\",VLOOKUP(P6,$B$5:$M$54,12,FALSE))","v":""},{"$f":"IF(AJ6=1,IF(Q6-Visualization!$S$20>Visualization!$S$21-Q6,\"USL\",\"LSL\"),\"\")","v":""},null,{"$f":"IF(COUNTIF(R6:Z6,\"OK\")=9,Q6,\"\")","v":""},{"$f":"IF(AND(COUNTIF(R6:Z6,\"OK\")<>9,COUNTIF(R6:Z6,\"NG\")<>9),Q6,\"\")","v":""},{"$f":"IF(COUNTIF(R6:Z6,\"NG\")=9,Q6,\"\")","v":""},null,{"$f":"IF(AND($AR$44>Q6,$L$4>Q7),1,0)","v":0},{"$f":"IF(AND(Q6>$AR$43,Q7>$L$3),1,0)","v":0},{"$f":"IF(AH6=AG6,1,0)","v":1},{"$f":"IF(OR(AND(AH6=0,AH5=1,AI6=1),AND(AG6=0,AG7=1,AI6=1)),1,0)","v":0},null,{"$f":"IF(AN6=\"\",\"\",RANK(AN6,$AN$5:$AN$54))","v":""},{"$f":"IF(OR(COUNTIF(R6:Z6,\"NG\")=9,COUNTIF(R6:Z6,\"OK\")=9),1,0.5)","v":0.5},"",null,2,{"$f":"IF(COUNTIF(AL6:AL55,AP6)=1,VLOOKUP(AP6,$AL$5:$AN$54,3,FALSE),\"\")","v":""},null,null,null,{"$f":"IF($AR$31=\"\",\"\",IF(AND(AU5<($AS$41*$AR$30+$AU$5),AU5>-999999999999999),AU5+$AR$31,\"\"))","v":""},{"$f":"IF(AU6=\"\",\"\",FREQUENCY($AC$5:$AC$54,AU6))","v":""},{"$f":"IF(AV6=\"\",\"\",AV6-AV5)","v":""},{"$f":"IF(AU6=\"\",\"\",FREQUENCY($AD$5:$AD$54,AU6))","v":""},{"$f":"IF(AX6=\"\",\"\",AX6-AX5)","v":""},{"$f":"IF(AU6=\"\",\"\",FREQUENCY($AE$5:$AE$54,AU6))","v":""},{"$f":"IF(AZ6=\"\",\"\",AZ6-AZ5)","v":""},{"$f":"SUM((AW6,AY6,BA6))","v":0},null,3,{"$f":"Visualization!$S$20","v":0},{"$f":"Visualization!$S$21","v":0},{"$f":"Calculation!$AQ$5","v":""},{"$f":"Calculation!$AQ$6","v":""},{"$f":"Calculation!$AQ$7","v":""},{"$f":"Calculation!$AQ$8","v":""},{"$f":"Calculation!$AQ$9","v":""},{"$f":"Calculation!$AQ$10","v":""},{"$f":"Calculation!$AQ$11","v":""},{"$f":"Calculation!$AQ$12","v":""},{"$f":"Calculation!$AQ$13","v":""},{"$f":"Calculation!$AQ$14","v":""}]
[null,"",3,{"$f":"IF(Values!C7=\"\",\"\",Values!C7)","v":""},{"$f":"IF(Values!D7=\"\",\"\",Values!D7)","v":""},{"$f":"IF(Values!E7=\"\",\"\",Values!E7)","v":""},{"$f":"IF(Values!F7=\"\",\"\",Values!F7)","v":""},{"$f":"IF(Values!G7=\"\",\"\",Values!G7)","v":""},{"$f":"IF(Values!H7=\"\",\"\",Values!H7)","v":""},{"$f":"IF(Values!I7=\"\",\"\",Values!I7)","v":""},{"$f":"IF(Values!J7=\"\",\"\",Values!J7)","v":""},{"$f":"IF(Values!K7=\"\",\"\",Values!K7)","v":""},{"$f":"IF(Values!L7=\"\",\"\",Values!L7)","v":""},null,"",3,"","","","","","","","","","",{"$f":"IF(AJ7=1,IF(Q7-Visualization!$S$20>Visualization!$S$21-Q7,\"USL\",\"LSL\"),\"\")","v":""},null,"","","",null,0,0,1,0,null,"",0.5,"",null,3,{"$f":"IF(COUNTIF(AL7:AL56,AP7)=1,VLOOKUP(AP7,$AL$5:$AN$54,3,FALSE),\"\")","v":""},{"$f":"IF(AQ7=\"\",\"\",AQ7-AQ8)","v":""},null,null,"","","","","","",{"$f":"IF(AZ7=\"\",\"\",AZ7-AZ6)","v":""},{"$f":"SUM((AW7,AY7,BA7))","v":0},null,4,{"$f":"Visualization!$S$20","v":0},{"$f":"Visualization!$S$21","v":0},{"$f":"Calculation!$AQ$5","v":""},{"$f":"Calculation!$AQ$6","v":""},{"$f":"Calculation!$AQ$7","v":""},{"$f":"Calculation!$AQ$8","v":""},{"$f":"Calculation!$AQ$9","v":""},{"$f":"Calculation!$AQ$10","v":""},{"$f":"Calculation!$AQ$11","v":""},{"$f":"Calculation!$AQ$12","v":""},{"$f":"Calculation!$AQ$13","v":""},{"$f":"Calculation!$AQ$14","v":""}]
[null,"",4,{"$f":"IF(Values!C8=\"\",\"\",Values!C8)","v":""},{"$f":"IF(Values!D8=\"\",\"\",Values!D8)","v":""},{"$f":"IF(Values!E8=\"\",\"\",Values!E8)","v":""},{"$f":"IF(Values!F8=\"\",\"\",Values!F8)","v":""},{"$f":"IF(Values!G8=\"\",\"\",Values!G8)","v":""},{"$f":"IF(Values!H8=\"\",\"\",Values!H8)","v":""},{"$f":"IF(Values!I8=\"\",\"\",Values!I8)","v":""},{"$f":"IF(Values!J8=\"\",\"\",Values!J8)","v":""},{"$f":"IF(Values!K8=\"\",\"\",Values!K8)","v":""},{"$f":"IF(Values!L8=\"\",\"\",Values!L8)","v":""},null,"",4,"","","","","","","","","","",{"$f":"IF(AJ8=1,IF(Q8-Visualization!$S$20>Visualization!$S$21-Q8,\"USL\",\"LSL\"),\"\")","v":""},null,"","","",null,0,0,1,0,null,"",0.5,"",null,4,"",null,null,null,"","","","","","","",{"$f":"SUM((AW8,AY8,BA8))","v":0},null,5,{"$f":"Visualization!$S$20","v":0},{"$f":"Visualization!$S$21","v":0},{"$f":"Calculation!$AQ$5","v":""},{"$f":"Calculation!$AQ$6","v":""},{"$f":"Calculation!$AQ$7","v":""},{"$f":"Calculation!$AQ$8","v":""},{"$f":"Calculation!$AQ$9","v":""},{"$f":"Calculation!$AQ$10","v":""},{"$f":"Calculation!$AQ$11","v":""},{"$f":"Calculation!$AQ$12","v":""},{"$f":"Calculation!$AQ$13","v":""},{"$f":"Calculation!$AQ$14","v":""}]
[null,"",5,{"$f":"IF(Values!C9=\"\",\"\",Values!C9)","v":""},{"$f":"IF(Values!D9=\"\",\"\",Values!D9)","v":""},{"$f":"IF(Values!E9=\"\",\"\",Values!E9)","v":""},{"$f":"IF(Values!F9=\"\",\"\",Values!F9)","v":""},{"$f":"IF(Values!G9=\"\",\"\",Values!G9)","v":""},{"$f":"IF(Values!H9=\"\",\"\",Values!H9)","v":""},{"$f":"IF(Values!I9=\"\",\"\",Values!I9)","v":""},{"$f":"IF(Values!J9=\"\",\"\",Values!J9)","v":""},{"$f":"IF(Values!K9=\"\",\"\",Values!K9)","v":""},{"$f":"IF(Values!L9=\"\",\"\",Values!L9)","v":""},null,"",5,"","","","","","","","","","",{"$f":"IF(AJ9=1,IF(Q9-Visualization!$S$20>Visualization!$S$21-Q9,\"USL\",\"LSL\"),\"\")","v":""},null,"","","",null,0,0,1,0,null,"",0.5,"",null,5,"",{"$f":"IF(AQ9=\"\",\"\",AQ9-AQ10)","v":""},null,null,"","","","","","","",{"$f":"SUM((AW9,AY9,BA9))","v":0},null,6,{"$f":"Visualization!$S$20","v":0},{"$f":"Visualization!$S$21","v":0},{"$f":"Calculation!$AQ$5","v":""},{"$f":"Calculation!$AQ$6","v":""},{"$f":"Calculation!$AQ$7","v":""},{"$f":"Calculation!$AQ$8","v":""},{"$f":"Calculation!$AQ$9","v":""},{"$f":"Calculation!$AQ$10","v":""},{"$f":"Calculation!$AQ$11","v":""},{"$f":"Calculation!$AQ$12","v":""},{"$f":"Calculation!$AQ$13","v":""},{"$f":"Calculation!$AQ$14","v":""}]
[null,"",6,{"$f":"IF(Values!C10=\"\",\"\",Values!C10)","v":""},{"$f":"IF(Values!D10=\"\",\"\",Values!D10)","v":""},{"$f":"IF(Values!E10=\"\",\"\",Values!E10)","v":""},{"$f":"IF(Values!F10=\"\",\"\",Values!F10)","v":""},{"$f":"IF(Values!G10=\"\",\"\",Values!G10)","v":""},{"$f":"IF(Values!H10=\"\",\"\",Values!H10)","v":""},{"$f":"IF(Values!I10=\"\",\"\",Values!I10)","v":""},{"$f":"IF(Values!J10=\"\",\"\",Values!J10)","v":""},{"$f":"IF(Values!K10=\"\",\"\",Values!K10)","v":""},{"$f":"IF(Values!L10=\"\",\"\",Values!L10)","v":""},null,"",6,"","","","","","","","","","",{"$f":"IF(AJ10=1,IF(Q10-Visualization!$S$20>Visualization!$S$21-Q10,\"USL\",\"LSL\"),\"\")","v":""},null,"","","",null,0,0,1,0,null,"",0.5,"",null,6,"",null,null,null,"","","","","","","",{"$f":"SUM((AW10,AY10,BA10))","v":0},null,7,{"$f":"Visualization!$S$20","v":0},{"$f":"Visualization!$S$21","v":0},{"$f":"Calculation!$AQ$5","v":""},{"$f":"Calculation!$AQ$6","v":""},{"$f":"Calculation!$AQ$7","v":""},{"$f":"Calculation!$AQ$8","v":""},{"$f":"Calculation!$AQ$9","v":""},{"$f":"Calculation!$AQ$10","v":""},{"$f":"Calculation!$AQ$11","v":""},{"$f":"Calculation!$AQ$12","v":""},{"$f":"Calculation!$AQ$13","v":""},{"$f":"Calculation!$AQ$14","v":""}]
[null,"",7,{"$f":"IF(Values!C11=\"\",\"\",Values!C11)","v":""},{"$f":"IF(Values!D11=\"\",\"\",Values!D11)","v":""},{"$f":"IF(Values!E11=\"\",\"\",Values!E11)","v":""},{"$f":"IF(Values!F11=\"\",\"\",Values!F11)","v":""},{"$f":"IF(Values!G11=\"\",\"\",Values!G11)","v":""},{"$f":"IF(Values!H11=\"\",\"\",Values!H11)","v":""},{"$f":"IF(Values!I11=\"\",\"\",Values!I11)","v":""},{"$f":"IF(Values!J11=\"\",\"\",Values!J11)","v":""},{"$f":"IF(Values!K11=\"\",\"\",Values!K11)","v":""},{"$f":"IF(Values!L11=\"\",\"\",Values!L11)","v":""},null,"",7,"","","","","","","","","","",{"$f":"IF(AJ11=1,IF(Q11-Visualization!$S$20>Visualization!$S$21-Q11,\"USL\",\"LSL\"),\"\")","v":""},null,"","","",null,0,0,1,0,null,"",0.5,"",null,7,"",{"$f":"IF(AQ11=\"\",\"\",AQ11-AQ12)","v":""},null,null,"","","","","","","",{"$f":"SUM((AW11,AY11,BA11))","v":0},null,8,{"$f":"Visualization!$S$20","v":0},{"$f":"Visualization!$S$21","v":0},{"$f":"Calculation!$AQ$5","v":""},{"$f":"Calculation!$AQ$6","v":""},{"$f":"Calculation!$AQ$7","v":""},{"$f":"Calculation!$AQ$8","v":""},{"$f":"Calculation!$AQ$9","v":""},{"$f":"Calculation!$AQ$10","v":""},{"$f":"Calculation!$AQ$11","v":""},{"$f":"Calculation!$AQ$12","v":""},{"$f":"Calculation!$AQ$13","v":""},{"$f":"Calculation!$AQ$14","v":""}]
[null,"",8,{"$f":"IF(Values!C12=\"\",\"\",Values!C12)","v":""},{"$f":"IF(Values!D12=\"\",\"\",Values!D12)","v":""},{"$f":"IF(Values!E12=\"\",\"\",Values!E12)","v":""},{"$f":"IF(Values!F12=\"\",\"\",Values!F12)","v":""},{"$f":"IF(Values!G12=\"\",\"\",Values!G12)","v":""},{"$f":"IF(Values!H12=\"\",\"\",Values!H12)","v":""},{"$f":"IF(Values!I12=\"\",\"\",Values!I12)","v":""},{"$f":"IF(Values!J12=\"\",\"\",Values!J12)","v":""},{"$f":"IF(Values!K12=\"\",\"\",Values!K12)","v":""},{"$f":"IF(Values!L12=\"\",\"\",Values!L12)","v":""},null,"",8,"","","","","","","","","","",{"$f":"IF(AJ12=1,IF(Q12-Visualization!$S$20>Visualization!$S$21-Q12,\"USL\",\"LSL\"),\"\")","v":""},null,"","","",null,0,0,1,0,null,"",0.5,"",null,8,"",null,null,null,"","","","","","","",{"$f":"SUM((AW12,AY12,BA12))","v":0},null,9,{"$f":"Visualization!$S$20","v":0},{"$f":"Visualization!$S$21","v":0},{"$f":"Calculation!$AQ$5","v":""},{"$f":"Calculation!$AQ$6","v":""},{"$f":"Calculation!$AQ$7","v":""},{"$f":"Calculation!$AQ$8","v":""},{"$f":"Calculation!$AQ$9","v":""},{"$f":"Calculation!$AQ$10","v":""},{"$f":"Calculation!$AQ$11","v":""},{"$f":"Calculation!$AQ$12","v":""},{"$f":"Calculation!$AQ$13","v":""},{"$f":"Calculation!$AQ$14","v":""}]
[null,"",9,{"$f":"IF(Values!C13=\"\",\"\",Values!C13)","v":""},{"$f":"IF(Values!D13=\"\",\"\",Values!D13)","v":""},{"$f":"IF(Values!E13=\"\",\"\",Values!E13)","v":""},{"$f":"IF(Values!F13=\"\",\"\",Values!F13)","v":""},{"$f":"IF(Values!G13=\"\",\"\",Values!G13)","v":""},{"$f":"IF(Values!H13=\"\",\"\",Values!H13)","v":""},{"$f":"IF(Values!I13=\"\",\"\",Values!I13)","v":""},{"$f":"IF(Values!J13=\"\",\"\",Values!J13)","v":""},{"$f":"IF(Values!K13=\"\",\"\",Values!K13)","v":""},{"$f":"IF(Values!L13=\"\",\"\",Values!L13)","v":""},null,"",9,"","","","","","","","","","",{"$f":"IF(AJ13=1,IF(Q13-Visualization!$S$20>Visualization!$S$21-Q13,\"USL\",\"LSL\"),\"\")","v":""},null,"","","",null,0,0,1,0,null,"",0.5,"",null,9,"",{"$f":"IF(AQ13=\"\",\"\",AQ13-AQ14)","v":""},null,null,"","","","","","","",{"$f":"SUM((AW13,AY13,BA13))","v":0},null,10,{"$f":"Visualization!$S$20","v":0},{"$f":"Visualization!$S$21","v":0},{"$f":"Calculation!$AQ$5","v":""},{"$f":"Calculation!$AQ$6","v":""},{"$f":"Calculation!$AQ$7","v":""},{"$f":"Calculation!$AQ$8","v":""},{"$f":"Calculation!$AQ$9","v":""},{"$f":"Calculation!$AQ$10","v":""},{"$f":"Calculation!$AQ$11","v":""},{"$f":"Calculation!$AQ$12","v":""},{"$f":"Calculation!$AQ$13","v":""},{"$f":"Calculation!$AQ$14","v":""}]
[null,"",10,{"$f":"IF(Values!C14=\"\",\"\",Values!C14)","v":""},{"$f":"IF(Values!D14=\"\",\"\",Values!D14)","v":""},{"$f":"IF(Values!E14=\"\",\"\",Values!E14)","v":""},{"$f":"IF(Values!F14=\"\",\"\",Values!F14)","v":""},{"$f":"IF(Values!G14=\"\",\"\",Values!G14)","v":""},{"$f":"IF(Values!H14=\"\",\"\",Values!H14)","v":""},{"$f":"IF(Values!I14=\"\",\"\",Values!I14)","v":""},{"$f":"IF(Values!J14=\"\",\"\",Values!J14)","v":""},{"$f":"IF(Values!K14=\"\",\"\",Values!K14)","v":""},{"$f":"IF(Values!L14=\"\",\"\",Values!L14)","v":""},null,"",10,"","","","","","","","","","",{"$f":"IF(AJ14=1,IF(Q14-Visualization!$S$20>Visualization!$S$21-Q14,\"USL\",\"LSL\"),\"\")","v":""},null,"","","",null,0,0,1,0,null,"",0.5,"",null,10,"",null,null,null,"","","","","","","",{"$f":"SUM((AW14,AY14,BA14))","v":0},null,11,{"$f":"Visualization!$S$20","v":0},{"$f":"Visualization!$S$21","v":0},{"$f":"Calculation!$AQ$5","v":""},{"$f":"Calculation!$AQ$6","v":""},{"$f":"Calculation!$AQ$7","v":""},{"$f":"Calculation!$AQ$8","v":""},{"$f":"Calculation!$AQ$9","v":""},{"$f":"Calculation!$AQ$10","v":""},{"$f":"Calculation!$AQ$11","v":""},{"$f":"Calculation!$AQ$12","v":""},{"$f":"Calculation!$AQ$13","v":""},{"$f":"Calculation!$AQ$14","v":""}]
[null,"",11,{"$f":"IF(Values!C15=\"\",\"\",Values!C15)","v":""},{"$f":"IF(Values!D15=\"\",\"\",Values!D15)","v":""},{"$f":"IF(Values!E15=\"\",\"\",Values!E15)","v":""},{"$f":"IF(Values!F15=\"\",\"\",Values!F15)","v":""},{"$f":"IF(Values!G15=\"\",\"\",Values!G15)","v":""},{"$f":"IF(Values!H15=\"\",\"\",Values!H15)","v":""},{"$f":"IF(Values!I15=\"\",\"\",Values!I15)","v":""},{"$f":"IF(Values!J15=\"\",\"\",Values!J15)","v":""},{"$f":"IF(Values!K15=\"\",\"\",Values!K15)","v":""},{"$f":"IF(Values!L15=\"\",\"\",Values!L15)","v":""},null,"",11,"","","","","","","","","","",{"$f":"IF(AJ15=1,IF(Q15-Visualization!$S$20>Visualization!$S$21-Q15,\"USL\",\"LSL\"),\"\")","v":""},null,"","","",null,0,0,1,0,null,"",0.5,"",null,null,"∑",{"$f":"IF(OR(AR9<>\"\",AR11<>\"\",AR13<>\"\",AR5=\"\"),\"\",SUM(AR5:AR14))","v":""},null,null,"","","","","","","",{"$f":"SUM((AW15,AY15,BA15))","v":0},null,12,{"$f":"Visualization!$S$20","v":0},{"$f":"Visualization!$S$21","v":0},{"$f":"Calculation!$AQ$5","v":""},{"$f":"Calculation!$AQ$6","v":""},{"$f":"Calculation!$AQ$7","v":""},{"$f":"Calculation!$AQ$8","v":""},{"$f":"Calculation!$AQ$9","v":""},{"$f":"Calculation!$AQ$10","v":""},{"$f":"Calculation!$AQ$11","v":""},{"$f":"Calculation!$AQ$12","v":""},{"$f":"Calculation!$AQ$13","v":""},{"$f":"Calculation!$AQ$14","v":""}]
{"$rows_left_out":40}
{"sheet":"Settings","index":5,"n_rows":26,"n_cols":8,"rows_kept":26,"cut":false,"hidden":true,"merged":[[23,7,24,10],[23,11,24,13],[25,7,26,10],[25,11,26,13],[19,4,19,5],[19,7,20,10],[19,11,20,13],[21,7,22,10],[21,11,22,13],[22,1,22,3],[6,7,8,13],[7,1,7,2],[7,3,7,5],[13,7,14,10],[16,1,16,5],[17,4,18,5],[10,1,10,5],[11,4,12,5],[13,4,13,5]]}
[]
[]
[]
[]
[]
[]
[null,null,null,null,null,null,null,"The integrated macros in this Worksheet are not required for the calculation. The macros just handle the scaling of the integrated charts. If you do not activate the macros, the sheet is still capable to calculate trustwothy indicies."]
[null,"Scale on",null,"Values"]
[]
[]
[null,"Scale on Specification"]
[null,null,"Upper","Lower","Scale-Factor \n(Standart = 0,3)"]
[null,"Max/Min",{"$f":"Visualization!S20","v":0},{"$f":"Visualization!S21","v":0}]
[null,"Scale on",{"$f":"IF(C13=\"\",\"\",C13+(C13-D13)*E14)","v":0},{"$f":"IF(D13=\"\",\"\",D13-(C13-D13)*E14)","v":0},0.3,null,null,"Print a pdf of the register \"Visualization\" to a folder of your choice."]
[]
{"$rows_left_out":12}
{"sheet":"References","index":6,"n_rows":13,"n_cols":2,"rows_kept":13,"cut":false,"hidden":true,"merged":[[3,1,8,9],[12,1,13,7]]}
[]
[]
[]
[null,"Calculation according \"Measurement System Capability\" Reference Manual.\n\nHead of work group:\nDr. Edgar Dietrich\n\n(Status: 17. September 2002)"]
[]
[]
[]
[]
[]
[]
[]
[]
[null,"Detailed references and calculation information are located in the Managment System doc-nr. 1758."]

{"sheet":"Directories","index":7,"n_rows":4,"n_cols":6,"rows_kept":4,"cut":false,"hidden":true,"merged":[]}
[]
[]
[]
[null,"Resolution",null,"Unit",null,"Measurement system"]