{"text_format":"1","workbook":"xlsx","n_sheets":8,"sheets":["Guide","Visualization","Values","Graphics","Calculation","Settings","References","Directories"],"not_rendered":{"charts":6,"images":12,"macros":1,"external_links":1,"defined_names":34,"comments":1,"pivot_tables":0},"unopened":[],"bounds":{"document_bytes":16777216,"sheet_cells":100000,"rows_first":2000,"rows_last":500,"rows_between":2000,"halvings":0,"cell_chars":16384,"cell_head_chars":4096},"cells_cut":0,"cells_raw":0,"read":"whole","date_system":"1900"}

{"sheet":"Guide","index":0,"n_rows":152,"n_cols":7,"rows_kept":152,"cut":false,"hidden":true,"merged":[[29,3,32,7],[4,2,4,8],[5,1,5,8],[9,3,9,6],[25,3,26,7],[27,3,28,7],[57,2,57,7],[58,2,58,7],[59,2,60,7],[81,2,81,7],[33,3,34,7],[36,3,37,7],[35,3,35,7],[38,3,39,7],[54,2,55,7],[56,2,56,7],[247,2,249,7],[260,6,264,8],[278,1,283,8],[80,2,80,7],[130,6,132,8],[136,6,137,8],[192,6,192,8],[194,6,196,8],[200,6,202,8],[234,2,236,7],[121,6,123,8],[125,6,127,8],[114,1,114,2],[114,3,114,7],[100,1,100,2],[100,3,100,7]]}
[]
[]
[]
[]
[null,"Important:"]
[null,"This file based on an Office 2010 version. For correct visualization and calculation use Office 2010 or higher."]
[]
[null,"Information:"]
[]
[null,null,null,"If a cell is gray, a input is mandatory"]
[]
[]
[]
[]
[null,"1.1 Open register \"Visualization\""]
[]
[]
[]
[]
[]
[]
[]
[]
[]
[]
[null,"Location: ",null,"Enter the location where the capability was done. \nFor Example: Germany; PMDM Villingen"]
[]
[null,"Line:",null,"Enter the line/place where your measurment system is located.\nFor Example: BLDC Line or QCArea"]
[]
[null,"Meas. System-Name:",null,"Enter a clear understandable name for your equipment. The name should correspond with your measurement equipment database.\nFor Example: Height gauge; Precision scale"]
[]
[]
[]
[null,"Meas. System-Nr.:",null,"Enter the measurment equipment number where you can find in your measurement equipment database."]
[]
[null,"Device-handling:",null,"Select if this device is handled manually or automatically"]
[null,"Resolution:",null,"Enter the Reolution of your System. \nFor Example: 0,001"]
[]
[null,"Date of Datacollection:",null,"Enter the dates of the start and end of your analysis."]
[]
[]
[]
[]
[]
[]
[]
[]
[null,"These cells will be filled out by ProFile. Not relevant for suppliers."]
[]
[]
[]
[]
[]
[]
[null,"Feature:","Enter the name of the feature you checked. \nFor Example: Distance between ball bearings"]
[]
[null,"Unit:","Enter the unit which you detect with your measurment system"]
[null,"USL:","Enter Upper Sepcification Limit"]
[null,"LSL:","Enter Lower Specification Limit"]
[null,"KPC:","Here you can enter the critical characteristic name in case the feature you are checking is a special characteristic. The DropDown allows you to choose options."]
[]
[]
[]
[]
[]
[null,"2.1 Open register \"Values\""]
[]
[]
[]
[]
[]
[]
[]
[]
[]
[]
[]
[]
[]
[]
[null,"Ref. Value","Please enter the Master value of your used parts."]
[null,"X1; X2; Xn:","Please enter all values into the columns. You can use the drop down in each cell."]
[]
[]
[]
[null,"3.1 Open register \"Visualization\""]
[null,"3.2 Good Result"]
[]
[]
[]
[]
[]
[]
[]
[]
[]
[]
[]
[]
[]
[null,"%gAttrib:",null,"Value is smaller or equal to 10%"]
[]
[null,"3.3 Bad Result"]
[]
[]
[]
[]
[]
[]
[]
[]
[]
[]
[]
[null,"%gAttrib:",null,"Value is higher than 10%"]
[]
[]
[]
[null,"Open register \"Settings\""]
[]
[]
[null,null,null,null,null,null,"Specify what the chart should scale to (Tolerance; Max/Min value; Custom)"]
[]
[]
[]
[null,null,null,null,null,null,"Change the scaling factor to adapt the distance to the specification limits."]
[]
[]
[]
[]
[null,null,null,null,null,null,"Change the scaling factor to adapt the distance to the max and min value."]
[]
[]
[]
[]
[]
[null,null,null,null,null,null,"Enter the data to which the chart should scale on"]
[]
[]
[]
[]
[]
[]
[]
[]
[]
[]
[]
[]
[]
[]
[null,"Hide or Unhide registers to have a more detailed view into background processes."]

{"sheet":"Visualization","index":1,"n_rows":87,"n_cols":31,"rows_kept":87,"cut":false,"hidden":false,"merged":[[22,7,22,10],[11,13,11,16],[79,2,79,8],[79,26,79,29],[21,18,21,22],[23,2,24,8],[19,7,20,14],[19,24,21,27],[19,18,19,22],[20,18,20,22],[21,16,21,17],[79,12,79,15],[78,2,78,3],[78,4,78,5],[78,6,78,8],[78,18,78,24],[21,7,21,10],[22,16,22,22],[1,2,3,17],[19,16,19,17],[20,16,20,17],[5,13,7,19],[9,17,9,19],[10,17,10,19],[8,2,9,4],[6,2,6,3],[8,5,9,11],[11,17,11,19],[12,17,12,19],[13,17,13,19],[14,17,14,19],[9,13,9,16],[14,13,14,16],[15,13,15,16],[13,5,13,11],[10,13,10,16],[15,17,15,19],[12,13,12,16],[13,13,13,16],[14,5,14,11],[10,2,10,4],[11,2,11,4],[12,2,12,4],[1,1,3,1],[21,2,21,6],[19,2,20,6],[86,0,86,32],[1,18,3,31],[78,9,78,10],[80,18,80,23],[79,18,79,19],[80,2,80,5],[80,6,80,11],[80,12,80,17],[80,26,80,29],[13,2,13,4],[14,2,14,4],[7,5,7,11],[10,5,10,11],[11,5,11,11],[12,5,12,11],[7,2,7,4]]}
[]
[null,null,"Attr(2)_Proof of fitness with reference values"]
[]
[]
[]
[null,null,null,null,null,null,null,null,null,null,null,null,null,"Feature Independent"]
[]
[null,null,"Location:"]
[null,null,"Line:"]
[null,null,null,null,null,null,null,null,null,null,null,null,null,"Base ID:"]
[null,null,"Meas. System-Name:",null,null,null,null,null,null,null,null,null,null,"Revision:"]
[null,null,"Meas. System-No.:",null,null,null,null,null,null,null,null,null,null,"Version:"]
[null,null,"Device-handling:",null,null,null,null,null,null,null,null,null,null,"Released by (ID):"]
[null,null,"Resolution:",null,null,null,null,null,null,null,null,null,null,"Released by:"]
[null,null,"Date of Datacollection:",null,null,null,null,null,null,null,null,null,null,"Date of release:"]
[null,null,null,null,null,null,null,null,null,null,null,null,null,"Doc. Status:"]
[]
[]
[]
[null,null,"Feature:",null,null,null,null,null,null,null,null,null,null,null,null,null,"USL",null,null,null,null,null,null,null,"Feature \nDependent"]
[null,null,null,null,null,null,null,null,null,null,null,null,null,null,null,null,"LSL"]
[null,null,"Unit:",null,null,null,null,null,null,null,null,null,null,null,null,null,"KPC"]
[null,null,null,null,null,null,null,null,null,null,null,null,null,null,null,null,{"$f":"IF(OR(S22<>\"\",S22<>\"\"),\"  Feature is critical\",\"  No KPC feature\")","v":"  No KPC feature"}]
[null,null,"Measurment data"]
[]
[null,null,"Rank","n","Ref.",{"$f":"IF($F$13=\"manuell\",\"XA1\",\"X1\")","v":"X1"},{"$f":"IF($F$13=\"manuell\",\"XA2\",\"X2\")","v":"X2"},{"$f":"IF($F$13=\"manuell\",\"XA3\",\"X3\")","v":"X3"},{"$f":"IF($F$13=\"manuell\",\"XB1\",\"X4\")","v":"X4"},{"$f":"IF($F$13=\"manuell\",\"XB2\",\"X5\")","v":"X5"},{"$f":"IF($F$13=\"manuell\",\"XB3\",\"X6\")","v":"X6"},{"$f":"IF($F$13=\"manuell\",\"XC1\",\"X7\")","v":"X7"},{"$f":"IF($F$13=\"manuell\",\"XC2\",\"X8\")","v":"X8"},{"$f":"IF($F$13=\"manuell\",\"XC3\",\"X9\")","v":"X9"},null,null,null,"Rank","n","Ref.",{"$f":"IF($F$13=\"manuell\",\"XA1\",\"X1\")","v":"X1"},{"$f":"IF($F$13=\"manuell\",\"XA2\",\"X2\")","v":"X2"},{"$f":"IF($F$13=\"manuell\",\"XA3\",\"X3\")","v":"X3"},{"$f":"IF($F$13=\"manuell\",\"XB1\",\"X4\")","v":"X4"},{"$f":"IF($F$13=\"manuell\",\"XB2\",\"X5\")","v":"X5"},{"$f":"IF($F$13=\"manuell\",\"XB3\",\"X6\")","v":"X6"},{"$f":"IF($F$13=\"manuell\",\"XC1\",\"X7\")","v":"X7"},{"$f":"IF($F$13=\"manuell\",\"XC2\",\"X8\")","v":"X8"},{"$f":"IF($F$13=\"manuell\",\"XC3\",\"X9\")","v":"X9"}]
[null,null,1,{"$f":"Calculation!O5","v":""},{"$f":"Calculation!Q5","v":""},{"$f":"IF(Calculation!R5=\"\",\"\",IF(Calculation!R5=\"NG\",\"-\",\"+\"))","v":""},{"$f":"IF(Calculation!S5=\"\",\"\",IF(Calculation!S5=\"NG\",\"-\",\"+\"))","v":""},{"$f":"IF(Calculation!T5=\"\",\"\",IF(Calculation!T5=\"NG\",\"-\",\"+\"))","v":""},{"$f":"IF(Calculation!U5=\"\",\"\",IF(Calculation!U5=\"NG\",\"-\",\"+\"))","v":""},{"$f":"IF(Calculation!V5=\"\",\"\",IF(Calculation!V5=\"NG\",\"-\",\"+\"))","v":""},{"$f":"IF(Calculation!W5=\"\",\"\",IF(Calculation!W5=\"NG\",\"-\",\"+\"))","v":""},{"$f":"IF(Calculation!X5=\"\",\"\",IF(Calculation!X5=\"NG\",\"-\",\"+\"))","v":""},{"$f":"IF(Calculation!Y5=\"\",\"\",IF(Calculation!Y5=\"NG\",\"-\",\"+\"))","v":""},{"$f":"IF(Calculation!Z5=\"\",\"\",IF(Calculation!Z5=\"NG\",\"-\",\"+\"))","v":""},{"$f":"IF(AND(COUNTIF(F27:N27,\"-\")<>0,COUNTIF(F27:N27,\"+\")<>0),\"NG\",\"\")","v":""},{"$f":"Calculation!AA5","v":""},null,26,{"$f":"Calculation!O30","v":""},{"$f":"Calculation!Q30","v":""},{"$f":"IF(Calculation!R30=\"\",\"\",IF(Calculation!R30=\"NG\",\"-\",\"+\"))","v":""},{"$f":"IF(Calculation!S30=\"\",\"\",IF(Calculation!S30=\"NG\",\"-\",\"+\"))","v":""},{"$f":"IF(Calculation!T30=\"\",\"\",IF(Calculation!T30=\"NG\",\"-\",\"+\"))","v":""},{"$f":"IF(Calculation!U30=\"\",\"\",IF(Calculation!U30=\"NG\",\"-\",\"+\"))","v":""},{"$f":"IF(Calculation!V30=\"\",\"\",IF(Calculation!V30=\"NG\",\"-\",\"+\"))","v":""},{"$f":"IF(Calculation!W30=\"\",\"\",IF(Calculation!W30=\"NG\",\"-\",\"+\"))","v":""},{"$f":"IF(Calculation!X30=\"\",\"\",IF(Calculation!X30=\"NG\",\"-\",\"+\"))","v":""},{"$f":"IF(Calculation!Y30=\"\",\"\",IF(Calculation!Y30=\"NG\",\"-\",\"+\"))","v":""},{"$f":"IF(Calculation!Z30=\"\",\"\",IF(Calculation!Z30=\"NG\",\"-\",\"+\"))","v":""},{"$f":"IF(AND(COUNTIF(U27:AC27,\"-\")<>0,COUNTIF(U27:AC27,\"+\")<>0),\"NG\",\"\")","v":""},{"$f":"Calculation!AA30","v":""}]
[null,null,2,{"$f":"Calculation!O6","v":""},{"$f":"Calculation!Q6","v":""},{"$f":"IF(Calculation!R6=\"\",\"\",IF(Calculation!R6=\"NG\",\"-\",\"+\"))","v":""},{"$f":"IF(Calculation!S6=\"\",\"\",IF(Calculation!S6=\"NG\",\"-\",\"+\"))","v":""},{"$f":"IF(Calculation!T6=\"\",\"\",IF(Calculation!T6=\"NG\",\"-\",\"+\"))","v":""},{"$f":"IF(Calculation!U6=\"\",\"\",IF(Calculation!U6=\"NG\",\"-\",\"+\"))","v":""},{"$f":"IF(Calculation!V6=\"\",\"\",IF(Calculation!V6=\"NG\",\"-\",\"+\"))","v":""},{"$f":"IF(Calculation!W6=\"\",\"\",IF(Calculation!W6=\"NG\",\"-\",\"+\"))","v":""},{"$f":"IF(Calculation!X6=\"\",\"\",IF(Calculation!X6=\"NG\",\"-\",\"+\"))","v":""},{"$f":"IF(Calculation!Y6=\"\",\"\",IF(Calculation!Y6=\"NG\",\"-\",\"+\"))","v":""},{"$f":"IF(Calculation!Z6=\"\",\"\",IF(Calculation!Z6=\"NG\",\"-\",\"+\"))","v":""},{"$f":"IF(AND(COUNTIF(F28:N28,\"-\")<>0,COUNTIF(F28:N28,\"+\")<>0),\"NG\",\"\")","v":""},{"$f":"Calculation!AA6","v":""},null,27,{"$f":"Calculation!O31","v":""},{"$f":"Calculation!Q31","v":""},{"$f":"IF(Calculation!R31=\"\",\"\",IF(Calculation!R31=\"NG\",\"-\",\"+\"))","v":""},{"$f":"IF(Calculation!S31=\"\",\"\",IF(Calculation!S31=\"NG\",\"-\",\"+\"))","v":""},{"$f":"IF(Calculation!T31=\"\",\"\",IF(Calculation!T31=\"NG\",\"-\",\"+\"))","v":""},{"$f":"IF(Calculation!U31=\"\",\"\",IF(Calculation!U31=\"NG\",\"-\",\"+\"))","v":""},{"$f":"IF(Calculation!V31=\"\",\"\",IF(Calculation!V31=\"NG\",\"-\",\"+\"))","v":""},{"$f":"IF(Calculation!W31=\"\",\"\",IF(Calculation!W31=\"NG\",\"-\",\"+\"))","v":""},{"$f":"IF(Calculation!X31=\"\",\"\",IF(Calculation!X31=\"NG\",\"-\",\"+\"))","v":""},{"$f":"IF(Calculation!Y31=\"\",\"\",IF(Calculation!Y31=\"NG\",\"-\",\"+\"))","v":""},{"$f":"IF(Calculation!Z31=\"\",\"\",IF(Calculation!Z31=\"NG\",\"-\",\"+\"))","v":""},{"$f":"IF(AND(COUNTIF(U28:AC28,\"-\")<>0,COUNTIF(U28:AC28,\"+\")<>0),\"NG\",\"\")","v":""},{"$f":"Calculation!AA31","v":""}]
[null,null,3,{"$f":"Calculation!O7","v":""},{"$f":"Calculation!Q7","v":""},{"$f":"IF(Calculation!R7=\"\",\"\",IF(Calculation!R7=\"NG\",\"-\",\"+\"))","v":""},{"$f":"IF(Calculation!S7=\"\",\"\",IF(Calculation!S7=\"NG\",\"-\",\"+\"))","v":""},{"$f":"IF(Calculation!T7=\"\",\"\",IF(Calculation!T7=\"NG\",\"-\",\"+\"))","v":""},{"$f":"IF(Calculation!U7=\"\",\"\",IF(Calculation!U7=\"NG\",\"-\",\"+\"))","v":""},{"$f":"IF(Calculation!V7=\"\",\"\",IF(Calculation!V7=\"NG\",\"-\",\"+\"))","v":""},{"$f":"IF(Calculation!W7=\"\",\"\",IF(Calculation!W7=\"NG\",\"-\",\"+\"))","v":""},{"$f":"IF(Calculation!X7=\"\",\"\",IF(Calculation!X7=\"NG\",\"-\",\"+\"))","v":""},{"$f":"IF(Calculation!Y7=\"\",\"\",IF(Calculation!Y7=\"NG\",\"-\",\"+\"))","v":""},{"$f":"IF(Calculation!Z7=\"\",\"\",IF(Calculation!Z7=\"NG\",\"-\",\"+\"))","v":""},"",{"$f":"Calculation!AA7","v":""},null,28,{"$f":"Calculation!O32","v":""},{"$f":"Calculation!Q32","v":""},{"$f":"IF(Calculation!R32=\"\",\"\",IF(Calculation!R32=\"NG\",\"-\",\"+\"))","v":""},{"$f":"IF(Calculation!S32=\"\",\"\",IF(Calculation!S32=\"NG\",\"-\",\"+\"))","v":""},{"$f":"IF(Calculation!T32=\"\",\"\",IF(Calculation!T32=\"NG\",\"-\",\"+\"))","v":""},{"$f":"IF(Calculation!U32=\"\",\"\",IF(Calculation!U32=\"NG\",\"-\",\"+\"))","v":""},{"$f":"IF(Calculation!V32=\"\",\"\",IF(Calculation!V32=\"NG\",\"-\",\"+\"))","v":""},{"$f":"IF(Calculation!W32=\"\",\"\",IF(Calculation!W32=\"NG\",\"-\",\"+\"))","v":""},{"$f":"IF(Calculation!X32=\"\",\"\",IF(Calculation!X32=\"NG\",\"-\",\"+\"))","v":""},{"$f":"IF(Calculation!Y32=\"\",\"\",IF(Calculation!Y32=\"NG\",\"-\",\"+\"))","v":""},{"$f":"IF(Calculation!Z32=\"\",\"\",IF(Calculation!Z32=\"NG\",\"-\",\"+\"))","v":""},"",{"$f":"Calculation!AA32","v":""}]
[null,null,4,{"$f":"Calculation!O8","v":""},{"$f":"Calculation!Q8","v":""},{"$f":"IF(Calculation!R8=\"\",\"\",IF(Calculation!R8=\"NG\",\"-\",\"+\"))","v":""},{"$f":"IF(Calculation!S8=\"\",\"\",IF(Calculation!S8=\"NG\",\"-\",\"+\"))","v":""},{"$f":"IF(Calculation!T8=\"\",\"\",IF(Calculation!T8=\"NG\",\"-\",\"+\"))","v":""},{"$f":"IF(Calculation!U8=\"\",\"\",IF(Calculation!U8=\"NG\",\"-\",\"+\"))","v":""},{"$f":"IF(Calculation!V8=\"\",\"\",IF(Calculation!V8=\"NG\",\"-\",\"+\"))","v":""},{"$f":"IF(Calculation!W8=\"\",\"\",IF(Calculation!W8=\"NG\",\"-\",\"+\"))","v":""},{"$f":"IF(Calculation!X8=\"\",\"\",IF(Calculation!X8=\"NG\",\"-\",\"+\"))","v":""},{"$f":"IF(Calculation!Y8=\"\",\"\",IF(Calculation!Y8=\"NG\",\"-\",\"+\"))","v":""},{"$f":"IF(Calculation!Z8=\"\",\"\",IF(Calculation!Z8=\"NG\",\"-\",\"+\"))","v":""},"",{"$f":"Calculation!AA8","v":""},null,29,{"$f":"Calculation!O33","v":""},{"$f":"Calculation!Q33","v":""},{"$f":"IF(Calculation!R33=\"\",\"\",IF(Calculation!R33=\"NG\",\"-\",\"+\"))","v":""},{"$f":"IF(Calculation!S33=\"\",\"\",IF(Calculation!S33=\"NG\",\"-\",\"+\"))","v":""},{"$f":"IF(Calculation!T33=\"\",\"\",IF(Calculation!T33=\"NG\",\"-\",\"+\"))","v":""},{"$f":"IF(Calculation!U33=\"\",\"\",IF(Calculation!U33=\"NG\",\"-\",\"+\"))","v":""},{"$f":"IF(Calculation!V33=\"\",\"\",IF(Calculation!V33=\"NG\",\"-\",\"+\"))","v":""},{"$f":"IF(Calculation!W33=\"\",\"\",IF(Calculation!W33=\"NG\",\"-\",\"+\"))","v":""},{"$f":"IF(Calculation!X33=\"\",\"\",IF(Calculation!X33=\"NG\",\"-\",\"+\"))","v":""},{"$f":"IF(Calculation!Y33=\"\",\"\",IF(Calculation!Y33=\"NG\",\"-\",\"+\"))","v":""},{"$f":"IF(Calculation!Z33=\"\",\"\",IF(Calculation!Z33=\"NG\",\"-\",\"+\"))","v":""},"",{"$f":"Calculation!AA33","v":""}]
[null,null,5,{"$f":"Calculation!O9","v":""},{"$f":"Calculation!Q9","v":""},{"$f":"IF(Calculation!R9=\"\",\"\",IF(Calculation!R9=\"NG\",\"-\",\"+\"))","v":""},{"$f":"IF(Calculation!S9=\"\",\"\",IF(Calculation!S9=\"NG\",\"-\",\"+\"))","v":""},{"$f":"IF(Calculation!T9=\"\",\"\",IF(Calculation!T9=\"NG\",\"-\",\"+\"))","v":""},{"$f":"IF(Calculation!U9=\"\",\"\",IF(Calculation!U9=\"NG\",\"-\",\"+\"))","v":""},{"$f":"IF(Calculation!V9=\"\",\"\",IF(Calculation!V9=\"NG\",\"-\",\"+\"))","v":""},{"$f":"IF(Calculation!W9=\"\",\"\",IF(Calculation!W9=\"NG\",\"-\",\"+\"))","v":""},{"$f":"IF(Calculation!X9=\"\",\"\",IF(Calculation!X9=\"NG\",\"-\",\"+\"))","v":""},{"$f":"IF(Calculation!Y9=\"\",\"\",IF(Calculation!Y9=\"NG\",\"-\",\"+\"))","v":""},{"$f":"IF(Calculation!Z9=\"\",\"\",IF(Calculation!Z9=\"NG\",\"-\",\"+\"))","v":""},"",{"$f":"Calculation!AA9","v":""},null,30,{"$f":"Calculation!O34","v":""},{"$f":"Calculation!Q34","v":""},{"$f":"IF(Calculation!R34=\"\",\"\",IF(Calculation!R34=\"NG\",\"-\",\"+\"))","v":""},{"$f":"IF(Calculation!S34=\"\",\"\",IF(Calculation!S34=\"NG\",\"-\",\"+\"))","v":""},{"$f":"IF(Calculation!T34=\"\",\"\",IF(Calculation!T34=\"NG\",\"-\",\"+\"))","v":""},{"$f":"IF(Calculation!U34=\"\",\"\",IF(Calculation!U34=\"NG\",\"-\",\"+\"))","v":""},{"$f":"IF(Calculation!V34=\"\",\"\",IF(Calculation!V34=\"NG\",\"-\",\"+\"))","v":""},{"$f":"IF(Calculation!W34=\"\",\"\",IF(Calculation!W34=\"NG\",\"-\",\"+\"))","v":""},{"$f":"IF(Calculation!X34=\"\",\"\",IF(Calculation!X34=\"NG\",\"-\",\"+\"))","v":""},{"$f":"IF(Calculation!Y34=\"\",\"\",IF(Calculation!Y34=\"NG\",\"-\",\"+\"))","v":""},{"$f":"IF(Calculation!Z34=\"\",\"\",IF(Calculation!Z34=\"NG\",\"-\",\"+\"))","v":""},"",{"$f":"Calculation!AA34","v":""}]
[null,null,6,{"$f":"Calculation!O10","v":""},{"$f":"Calculation!Q10","v":""},{"$f":"IF(Calculation!R10=\"\",\"\",IF(Calculation!R10=\"NG\",\"-\",\"+\"))","v":""},{"$f":"IF(Calculation!S10=\"\",\"\",IF(Calculation!S10=\"NG\",\"-\",\"+\"))","v":""},{"$f":"IF(Calculation!T10=\"\",\"\",IF(Calculation!T10=\"NG\",\"-\",\"+\"))","v":""},{"$f":"IF(Calculation!U10=\"\",\"\",IF(Calculation!U10=\"NG\",\"-\",\"+\"))","v":""},{"$f":"IF(Calculation!V10=\"\",\"\",IF(Calculation!V10=\"NG\",\"-\",\"+\"))","v":""},{"$f":"IF(Calculation!W10=\"\",\"\",IF(Calculation!W10=\"NG\",\"-\",\"+\"))","v":""},{"$f":"IF(Calculation!X10=\"\",\"\",IF(Calculation!X10=\"NG\",\"-\",\"+\"))","v":""},{"$f":"IF(Calculation!Y10=\"\",\"\",IF(Calculation!Y10=\"NG\",\"-\",\"+\"))","v":""},{"$f":"IF(Calculation!Z10=\"\",\"\",IF(Calculation!Z10=\"NG\",\"-\",\"+\"))","v":""},"",{"$f":"Calculation!AA10","v":""},null,31,{"$f":"Calculation!O35","v":""},{"$f":"Calculation!Q35","v":""},{"$f":"IF(Calculation!R35=\"\",\"\",IF(Calculation!R35=\"NG\",\"-\",\"+\"))","v":""},{"$f":"IF(Calculation!S35=\"\",\"\",IF(Calculation!S35=\"NG\",\"-\",\"+\"))","v":""},{"$f":"IF(Calculation!T35=\"\",\"\",IF(Calculation!T35=\"NG\",\"-\",\"+\"))","v":""},{"$f":"IF(Calculation!U35=\"\",\"\",IF(Calculation!U35=\"NG\",\"-\",\"+\"))","v":""},{"$f":"IF(Calculation!V35=\"\",\"\",IF(Calculation!V35=\"NG\",\"-\",\"+\"))","v":""},{"$f":"IF(Calculation!W35=\"\",\"\",IF(Calculation!W35=\"NG\",\"-\",\"+\"))","v":""},{"$f":"IF(Calculation!X35=\"\",\"\",IF(Calculation!X35=\"NG\",\"-\",\"+\"))","v":""},{"$f":"IF(Calculation!Y35=\"\",\"\",IF(Calculation!Y35=\"NG\",\"-\",\"+\"))","v":""},{"$f":"IF(Calculation!Z35=\"\",\"\",IF(Calculation!Z35=\"NG\",\"-\",\"+\"))","v":""},"",{"$f":"Calculation!AA35","v":""}]
[null,null,7,{"$f":"Calculation!O11","v":""},{"$f":"Calculation!Q11","v":""},{"$f":"IF(Calculation!R11=\"\",\"\",IF(Calculation!R11=\"NG\",\"-\",\"+\"))","v":""},{"$f":"IF(Calculation!S11=\"\",\"\",IF(Calculation!S11=\"NG\",\"-\",\"+\"))","v":""},{"$f":"IF(Calculation!T11=\"\",\"\",IF(Calculation!T11=\"NG\",\"-\",\"+\"))","v":""},{"$f":"IF(Calculation!U11=\"\",\"\",IF(Calculation!U11=\"NG\",\"-\",\"+\"))","v":""},{"$f":"IF(Calculation!V11=\"\",\"\",IF(Calculation!V11=\"NG\",\"-\",\"+\"))","v":""},{"$f":"IF(Calculation!W11=\"\",\"\",IF(Calculation!W11=\"NG\",\"-\",\"+\"))","v":""},{"$f":"IF(Calculation!X11=\"\",\"\",IF(Calculation!X11=\"NG\",\"-\",\"+\"))","v":""},{"$f":"IF(Calculation!Y11=\"\",\"\",IF(Calculation!Y11=\"NG\",\"-\",\"+\"))","v":""},{"$f":"IF(Calculation!Z11=\"\",\"\",IF(Calculation!Z11=\"NG\",\"-\",\"+\"))","v":""},"",{"$f":"Calculation!AA11","v":""},null,32,{"$f":"Calculation!O36","v":""},{"$f":"Calculation!Q36","v":""},{"$f":"IF(Calculation!R36=\"\",\"\",IF(Calculation!R36=\"NG\",\"-\",\"+\"))","v":""},{"$f":"IF(Calculation!S36=\"\",\"\",IF(Calculation!S36=\"NG\",\"-\",\"+\"))","v":""},{"$f":"IF(Calculation!T36=\"\",\"\",IF(Calculation!T36=\"NG\",\"-\",\"+\"))","v":""},{"$f":"IF(Calculation!U36=\"\",\"\",IF(Calculation!U36=\"NG\",\"-\",\"+\"))","v":""},{"$f":"IF(Calculation!V36=\"\",\"\",IF(Calculation!V36=\"NG\",\"-\",\"+\"))","v":""},{"$f":"IF(Calculation!W36=\"\",\"\",IF(Calculation!W36=\"NG\",\"-\",\"+\"))","v":""},{"$f":"IF(Calculation!X36=\"\",\"\",IF(Calculation!X36=\"NG\",\"-\",\"+\"))","v":""},{"$f":"IF(Calculation!Y36=\"\",\"\",IF(Calculation!Y36=\"NG\",\"-\",\"+\"))","v":""},{"$f":"IF(Calculation!Z36=\"\",\"\",IF(Calculation!Z36=\"NG\",\"-\",\"+\"))","v":""},"",{"$f":"Calculation!AA36","v":""}]
[null,null,8,{"$f":"Calculation!O12","v":""},{"$f":"Calculation!Q12","v":""},{"$f":"IF(Calculation!R12=\"\",\"\",IF(Calculation!R12=\"NG\",\"-\",\"+\"))","v":""},{"$f":"IF(Calculation!S12=\"\",\"\",IF(Calculation!S12=\"NG\",\"-\",\"+\"))","v":""},{"$f":"IF(Calculation!T12=\"\",\"\",IF(Calculation!T12=\"NG\",\"-\",\"+\"))","v":""},{"$f":"IF(Calculation!U12=\"\",\"\",IF(Calculation!U12=\"NG\",\"-\",\"+\"))","v":""},{"$f":"IF(Calculation!V12=\"\",\"\",IF(Calculation!V12=\"NG\",\"-\",\"+\"))","v":""},{"$f":"IF(Calculation!W12=\"\",\"\",IF(Calculation!W12=\"NG\",\"-\",\"+\"))","v":""},{"$f":"IF(Calculation!X12=\"\",\"\",IF(Calculation!X12=\"NG\",\"-\",\"+\"))","v":""},{"$f":"IF(Calculation!Y12=\"\",\"\",IF(Calculation!Y12=\"NG\",\"-\",\"+\"))","v":""},{"$f":"IF(Calculation!Z12=\"\",\"\",IF(Calculation!Z12=\"NG\",\"-\",\"+\"))","v":""},"",{"$f":"Calculation!AA12","v":""},null,33,{"$f":"Calculation!O37","v":""},{"$f":"Calculation!Q37","v":""},{"$f":"IF(Calculation!R37=\"\",\"\",IF(Calculation!R37=\"NG\",\"-\",\"+\"))","v":""},{"$f":"IF(Calculation!S37=\"\",\"\",IF(Calculation!S37=\"NG\",\"-\",\"+\"))","v":""},{"$f":"IF(Calculation!T37=\"\",\"\",IF(Calculation!T37=\"NG\",\"-\",\"+\"))","v":""},{"$f":"IF(Calculation!U37=\"\",\"\",IF(Calculation!U37=\"NG\",\"-\",\"+\"))","v":""},{"$f":"IF(Calculation!V37=\"\",\"\",IF(Calculation!V37=\"NG\",\"-\",\"+\"))","v":""},{"$f":"IF(Calculation!W37=\"\",\"\",IF(Calculation!W37=\"NG\",\"-\",\"+\"))","v":""},{"$f":"IF(Calculation!X37=\"\",\"\",IF(Calculation!X37=\"NG\",\"-\",\"+\"))","v":""},{"$f":"IF(Calculation!Y37=\"\",\"\",IF(Calculation!Y37=\"NG\",\"-\",\"+\"))","v":""},{"$f":"IF(Calculation!Z37=\"\",\"\",IF(Calculation!Z37=\"NG\",\"-\",\"+\"))","v":""},"",{"$f":"Calculation!AA37","v":""}]
[null,null,9,{"$f":"Calculation!O13","v":""},{"$f":"Calculation!Q13","v":""},{"$f":"IF(Calculation!R13=\"\",\"\",IF(Calculation!R13=\"NG\",\"-\",\"+\"))","v":""},{"$f":"IF(Calculation!S13=\"\",\"\",IF(Calculation!S13=\"NG\",\"-\",\"+\"))","v":""},{"$f":"IF(Calculation!T13=\"\",\"\",IF(Calculation!T13=\"NG\",\"-\",\"+\"))","v":""},{"$f":"IF(Calculation!U13=\"\",\"\",IF(Calculation!U13=\"NG\",\"-\",\"+\"))","v":""},{"$f":"IF(Calculation!V13=\"\",\"\",IF(Calculation!V13=\"NG\",\"-\",\"+\"))","v":""},{"$f":"IF(Calculation!W13=\"\",\"\",IF(Calculation!W13=\"NG\",\"-\",\"+\"))","v":""},{"$f":"IF(Calculation!X13=\"\",\"\",IF(Calculation!X13=\"NG\",\"-\",\"+\"))","v":""},{"$f":"IF(Calculation!Y13=\"\",\"\",IF(Calculation!Y13=\"NG\",\"-\",\"+\"))","v":""},{"$f":"IF(Calculation!Z13=\"\",\"\",IF(Calculation!Z13=\"NG\",\"-\",\"+\"))","v":""},"",{"$f":"Calculation!AA13","v":""},null,34,{"$f":"Calculation!O38","v":""},{"$f":"Calculation!Q38","v":""},{"$f":"IF(Calculation!R38=\"\",\"\",IF(Calculation!R38=\"NG\",\"-\",\"+\"))","v":""},{"$f":"IF(Calculation!S38=\"\",\"\",IF(Calculation!S38=\"NG\",\"-\",\"+\"))","v":""},{"$f":"IF(Calculation!T38=\"\",\"\",IF(Calculation!T38=\"NG\",\"-\",\"+\"))","v":""},{"$f":"IF(Calculation!U38=\"\",\"\",IF(Calculation!U38=\"NG\",\"-\",\"+\"))","v":""},{"$f":"IF(Calculation!V38=\"\",\"\",IF(Calculation!V38=\"NG\",\"-\",\"+\"))","v":""},{"$f":"IF(Calculation!W38=\"\",\"\",IF(Calculation!W38=\"NG\",\"-\",\"+\"))","v":""},{"$f":"IF(Calculation!X38=\"\",\"\",IF(Calculation!X38=\"NG\",\"-\",\"+\"))","v":""},{"$f":"IF(Calculation!Y38=\"\",\"\",IF(Calculation!Y38=\"NG\",\"-\",\"+\"))","v":""},{"$f":"IF(Calculation!Z38=\"\",\"\",IF(Calculation!Z38=\"NG\",\"-\",\"+\"))","v":""},"",{"$f":"Calculation!AA38","v":""}]
[null,null,10,{"$f":"Calculation!O14","v":""},{"$f":"Calculation!Q14","v":""},{"$f":"IF(Calculation!R14=\"\",\"\",IF(Calculation!R14=\"NG\",\"-\",\"+\"))","v":""},{"$f":"IF(Calculation!S14=\"\",\"\",IF(Calculation!S14=\"NG\",\"-\",\"+\"))","v":""},{"$f":"IF(Calculation!T14=\"\",\"\",IF(Calculation!T14=\"NG\",\"-\",\"+\"))","v":""},{"$f":"IF(Calculation!U14=\"\",\"\",IF(Calculation!U14=\"NG\",\"-\",\"+\"))","v":""},{"$f":"IF(Calculation!V14=\"\",\"\",IF(Calculation!V14=\"NG\",\"-\",\"+\"))","v":""},{"$f":"IF(Calculation!W14=\"\",\"\",IF(Calculation!W14=\"NG\",\"-\",\"+\"))","v":""},{"$f":"IF(Calculation!X14=\"\",\"\",IF(Calculation!X14=\"NG\",\"-\",\"+\"))","v":""},{"$f":"IF(Calculation!Y14=\"\",\"\",IF(Calculation!Y14=\"NG\",\"-\",\"+\"))","v":""},{"$f":"IF(Calculation!Z14=\"\",\"\",IF(Calculation!Z14=\"NG\",\"-\",\"+\"))","v":""},"",{"$f":"Calculation!AA14","v":""},null,35,{"$f":"Calculation!O39","v":""},{"$f":"Calculation!Q39","v":""},{"$f":"IF(Calculation!R39=\"\",\"\",IF(Calculation!R39=\"NG\",\"-\",\"+\"))","v":""},{"$f":"IF(Calculation!S39=\"\",\"\",IF(Calculation!S39=\"NG\",\"-\",\"+\"))","v":""},{"$f":"IF(Calculation!T39=\"\",\"\",IF(Calculation!T39=\"NG\",\"-\",\"+\"))","v":""},{"$f":"IF(Calculation!U39=\"\",\"\",IF(Calculation!U39=\"NG\",\"-\",\"+\"))","v":""},{"$f":"IF(Calculation!V39=\"\",\"\",IF(Calculation!V39=\"NG\",\"-\",\"+\"))","v":""},{"$f":"IF(Calculation!W39=\"\",\"\",IF(Calculation!W39=\"NG\",\"-\",\"+\"))","v":""},{"$f":"IF(Calculation!X39=\"\",\"\",IF(Calculation!X39=\"NG\",\"-\",\"+\"))","v":""},{"$f":"IF(Calculation!Y39=\"\",\"\",IF(Calculation!Y39=\"NG\",\"-\",\"+\"))","v":""},{"$f":"IF(Calculation!Z39=\"\",\"\",IF(Calculation!Z39=\"NG\",\"-\",\"+\"))","v":""},"",{"$f":"Calculation!AA39","v":""}]
[null,null,11,{"$f":"Calculation!O15","v":""},{"$f":"Calculation!Q15","v":""},{"$f":"IF(Calculation!R15=\"\",\"\",IF(Calculation!R15=\"NG\",\"-\",\"+\"))","v":""},{"$f":"IF(Calculation!S15=\"\",\"\",IF(Calculation!S15=\"NG\",\"-\",\"+\"))","v":""},{"$f":"IF(Calculation!T15=\"\",\"\",IF(Calculation!T15=\"NG\",\"-\",\"+\"))","v":""},{"$f":"IF(Calculation!U15=\"\",\"\",IF(Calculation!U15=\"NG\",\"-\",\"+\"))","v":""},{"$f":"IF(Calculation!V15=\"\",\"\",IF(Calculation!V15=\"NG\",\"-\",\"+\"))","v":""},{"$f":"IF(Calculation!W15=\"\",\"\",IF(Calculation!W15=\"NG\",\"-\",\"+\"))","v":""},{"$f":"IF(Calculation!X15=\"\",\"\",IF(Calculation!X15=\"NG\",\"-\",\"+\"))","v":""},{"$f":"IF(Calculation!Y15=\"\",\"\",IF(Calculation!Y15=\"NG\",\"-\",\"+\"))","v":""},{"$f":"IF(Calculation!Z15=\"\",\"\",IF(Calculation!Z15=\"NG\",\"-\",\"+\"))","v":""},"",{"$f":"Calculation!AA15","v":""},null,36,{"$f":"Calculation!O40","v":""},{"$f":"Calculation!Q40","v":""},{"$f":"IF(Calculation!R40=\"\",\"\",IF(Calculation!R40=\"NG\",\"-\",\"+\"))","v":""},{"$f":"IF(Calculation!S40=\"\",\"\",IF(Calculation!S40=\"NG\",\"-\",\"+\"))","v":""},{"$f":"IF(Calculation!T40=\"\",\"\",IF(Calculation!T40=\"NG\",\"-\",\"+\"))","v":""},{"$f":"IF(Calculation!U40=\"\",\"\",IF(Calculation!U40=\"NG\",\"-\",\"+\"))","v":""},{"$f":"IF(Calculation!V40=\"\",\"\",IF(Calculation!V40=\"NG\",\"-\",\"+\"))","v":""},{"$f":"IF(Calculation!W40=\"\",\"\",IF(Calculation!W40=\"NG\",\"-\",\"+\"))","v":""},{"$f":"IF(Calculation!X40=\"\",\"\",IF(Calculation!X40=\"NG\",\"-\",\"+\"))","v":""},{"$f":"IF(Calculation!Y40=\"\",\"\",IF(Calculation!Y40=\"NG\",\"-\",\"+\"))","v":""},{"$f":"IF(Calculation!Z40=\"\",\"\",IF(Calculation!Z40=\"NG\",\"-\",\"+\"))","v":""},"",{"$f":"Calculation!AA40","v":""}]
[null,null,12,{"$f":"Calculation!O16","v":""},{"$f":"Calculation!Q16","v":""},{"$f":"IF(Calculation!R16=\"\",\"\",IF(Calculation!R16=\"NG\",\"-\",\"+\"))","v":""},{"$f":"IF(Calculation!S16=\"\",\"\",IF(Calculation!S16=\"NG\",\"-\",\"+\"))","v":""},{"$f":"IF(Calculation!T16=\"\",\"\",IF(Calculation!T16=\"NG\",\"-\",\"+\"))","v":""},{"$f":"IF(Calculation!U16=\"\",\"\",IF(Calculation!U16=\"NG\",\"-\",\"+\"))","v":""},{"$f":"IF(Calculation!V16=\"\",\"\",IF(Calculation!V16=\"NG\",\"-\",\"+\"))","v":""},{"$f":"IF(Calculation!W16=\"\",\"\",IF(Calculation!W16=\"NG\",\"-\",\"+\"))","v":""},{"$f":"IF(Calculation!X16=\"\",\"\",IF(Calculation!X16=\"NG\",\"-\",\"+\"))","v":""},{"$f":"IF(Calculation!Y16=\"\",\"\",IF(Calculation!Y16=\"NG\",\"-\",\"+\"))","v":""},{"$f":"IF(Calculation!Z16=\"\",\"\",IF(Calculation!Z16=\"NG\",\"-\",\"+\"))","v":""},"",{"$f":"Calculation!AA16","v":""},null,37,{"$f":"Calculation!O41","v":""},{"$f":"Calculation!Q41","v":""},{"$f":"IF(Calculation!R41=\"\",\"\",IF(Calculation!R41=\"NG\",\"-\",\"+\"))","v":""},{"$f":"IF(Calculation!S41=\"\",\"\",IF(Calculation!S41=\"NG\",\"-\",\"+\"))","v":""},{"$f":"IF(Calculation!T41=\"\",\"\",IF(Calculation!T41=\"NG\",\"-\",\"+\"))","v":""},{"$f":"IF(Calculation!U41=\"\",\"\",IF(Calculation!U41=\"NG\",\"-\",\"+\"))","v":""},{"$f":"IF(Calculation!V41=\"\",\"\",IF(Calculation!V41=\"NG\",\"-\",\"+\"))","v":""},{"$f":"IF(Calculation!W41=\"\",\"\",IF(Calculation!W41=\"NG\",\"-\",\"+\"))","v":""},{"$f":"IF(Calculation!X41=\"\",\"\",IF(Calculation!X41=\"NG\",\"-\",\"+\"))","v":""},{"$f":"IF(Calculation!Y41=\"\",\"\",IF(Calculation!Y41=\"NG\",\"-\",\"+\"))","v":""},{"$f":"IF(Calculation!Z41=\"\",\"\",IF(Calculation!Z41=\"NG\",\"-\",\"+\"))","v":""},"",{"$f":"Calculation!AA41","v":""}]
[null,null,13,{"$f":"Calculation!O17","v":""},{"$f":"Calculation!Q17","v":""},{"$f":"IF(Calculation!R17=\"\",\"\",IF(Calculation!R17=\"NG\",\"-\",\"+\"))","v":""},{"$f":"IF(Calculation!S17=\"\",\"\",IF(Calculation!S17=\"NG\",\"-\",\"+\"))","v":""},{"$f":"IF(Calculation!T17=\"\",\"\",IF(Calculation!T17=\"NG\",\"-\",\"+\"))","v":""},{"$f":"IF(Calculation!U17=\"\",\"\",IF(Calculation!U17=\"NG\",\"-\",\"+\"))","v":""},{"$f":"IF(Calculation!V17=\"\",\"\",IF(Calculation!V17=\"NG\",\"-\",\"+\"))","v":""},{"$f":"IF(Calculation!W17=\"\",\"\",IF(Calculation!W17=\"NG\",\"-\",\"+\"))","v":""},{"$f":"IF(Calculation!X17=\"\",\"\",IF(Calculation!X17=\"NG\",\"-\",\"+\"))","v":""},{"$f":"IF(Calculation!Y17=\"\",\"\",IF(Calculation!Y17=\"NG\",\"-\",\"+\"))","v":""},{"$f":"IF(Calculation!Z17=\"\",\"\",IF(Calculation!Z17=\"NG\",\"-\",\"+\"))","v":""},"",{"$f":"Calculation!AA17","v":""},null,38,{"$f":"Calculation!O42","v":""},{"$f":"Calculation!Q42","v":""},{"$f":"IF(Calculation!R42=\"\",\"\",IF(Calculation!R42=\"NG\",\"-\",\"+\"))","v":""},{"$f":"IF(Calculation!S42=\"\",\"\",IF(Calculation!S42=\"NG\",\"-\",\"+\"))","v":""},{"$f":"IF(Calculation!T42=\"\",\"\",IF(Calculation!T42=\"NG\",\"-\",\"+\"))","v":""},{"$f":"IF(Calculation!U42=\"\",\"\",IF(Calculation!U42=\"NG\",\"-\",\"+\"))","v":""},{"$f":"IF(Calculation!V42=\"\",\"\",IF(Calculation!V42=\"NG\",\"-\",\"+\"))","v":""},{"$f":"IF(Calculation!W42=\"\",\"\",IF(Calculation!W42=\"NG\",\"-\",\"+\"))","v":""},{"$f":"IF(Calculation!X42=\"\",\"\",IF(Calculation!X42=\"NG\",\"-\",\"+\"))","v":""},{"$f":"IF(Calculation!Y42=\"\",\"\",IF(Calculation!Y42=\"NG\",\"-\",\"+\"))","v":""},{"$f":"IF(Calculation!Z42=\"\",\"\",IF(Calculation!Z42=\"NG\",\"-\",\"+\"))","v":""},"",{"$f":"Calculation!AA42","v":""}]
[null,null,14,{"$f":"Calculation!O18","v":""},{"$f":"Calculation!Q18","v":""},{"$f":"IF(Calculation!R18=\"\",\"\",IF(Calculation!R18=\"NG\",\"-\",\"+\"))","v":""},{"$f":"IF(Calculation!S18=\"\",\"\",IF(Calculation!S18=\"NG\",\"-\",\"+\"))","v":""},{"$f":"IF(Calculation!T18=\"\",\"\",IF(Calculation!T18=\"NG\",\"-\",\"+\"))","v":""},{"$f":"IF(Calculation!U18=\"\",\"\",IF(Calculation!U18=\"NG\",\"-\",\"+\"))","v":""},{"$f":"IF(Calculation!V18=\"\",\"\",IF(Calculation!V18=\"NG\",\"-\",\"+\"))","v":""},{"$f":"IF(Calculation!W18=\"\",\"\",IF(Calculation!W18=\"NG\",\"-\",\"+\"))","v":""},{"$f":"IF(Calculation!X18=\"\",\"\",IF(Calculation!X18=\"NG\",\"-\",\"+\"))","v":""},{"$f":"IF(Calculation!Y18=\"\",\"\",IF(Calculation!Y18=\"NG\",\"-\",\"+\"))","v":""},{"$f":"IF(Calculation!Z18=\"\",\"\",IF(Calculation!Z18=\"NG\",\"-\",\"+\"))","v":""},"",{"$f":"Calculation!AA18","v":""},null,39,{"$f":"Calculation!O43","v":""},{"$f":"Calculation!Q43","v":""},{"$f":"IF(Calculation!R43=\"\",\"\",IF(Calculation!R43=\"NG\",\"-\",\"+\"))","v":""},{"$f":"IF(Calculation!S43=\"\",\"\",IF(Calculation!S43=\"NG\",\"-\",\"+\"))","v":""},{"$f":"IF(Calculation!T43=\"\",\"\",IF(Calculation!T43=\"NG\",\"-\",\"+\"))","v":""},{"$f":"IF(Calculation!U43=\"\",\"\",IF(Calculation!U43=\"NG\",\"-\",\"+\"))","v":""},{"$f":"IF(Calculation!V43=\"\",\"\",IF(Calculation!V43=\"NG\",\"-\",\"+\"))","v":""},{"$f":"IF(Calculation!W43=\"\",\"\",IF(Calculation!W43=\"NG\",\"-\",\"+\"))","v":""},{"$f":"IF(Calculation!X43=\"\",\"\",IF(Calculation!X43=\"NG\",\"-\",\"+\"))","v":""},{"$f":"IF(Calculation!Y43=\"\",\"\",IF(Calculation!Y43=\"NG\",\"-\",\"+\"))","v":""},{"$f":"IF(Calculation!Z43=\"\",\"\",IF(Calculation!Z43=\"NG\",\"-\",\"+\"))","v":""},"",{"$f":"Calculation!AA43","v":""}]
[null,null,15,{"$f":"Calculation!O19","v":""},{"$f":"Calculation!Q19","v":""},{"$f":"IF(Calculation!R19=\"\",\"\",IF(Calculation!R19=\"NG\",\"-\",\"+\"))","v":""},{"$f":"IF(Calculation!S19=\"\",\"\",IF(Calculation!S19=\"NG\",\"-\",\"+\"))","v":""},{"$f":"IF(Calculation!T19=\"\",\"\",IF(Calculation!T19=\"NG\",\"-\",\"+\"))","v":""},{"$f":"IF(Calculation!U19=\"\",\"\",IF(Calculation!U19=\"NG\",\"-\",\"+\"))","v":""},{"$f":"IF(Calculation!V19=\"\",\"\",IF(Calculation!V19=\"NG\",\"-\",\"+\"))","v":""},{"$f":"IF(Calculation!W19=\"\",\"\",IF(Calculation!W19=\"NG\",\"-\",\"+\"))","v":""},{"$f":"IF(Calculation!X19=\"\",\"\",IF(Calculation!X19=\"NG\",\"-\",\"+\"))","v":""},{"$f":"IF(Calculation!Y19=\"\",\"\",IF(Calculation!Y19=\"NG\",\"-\",\"+\"))","v":""},{"$f":"IF(Calculation!Z19=\"\",\"\",IF(Calculation!Z19=\"NG\",\"-\",\"+\"))","v":""},"",{"$f":"Calculation!AA19","v":""},null,40,{"$f":"Calculation!O44","v":""},{"$f":"Calculation!Q44","v":""},{"$f":"IF(Calculation!R44=\"\",\"\",IF(Calculation!R44=\"NG\",\"-\",\"+\"))","v":""},{"$f":"IF(Calculation!S44=\"\",\"\",IF(Calculation!S44=\"NG\",\"-\",\"+\"))","v":""},{"$f":"IF(Calculation!T44=\"\",\"\",IF(Calculation!T44=\"NG\",\"-\",\"+\"))","v":""},{"$f":"IF(Calculation!U44=\"\",\"\",IF(Calculation!U44=\"NG\",\"-\",\"+\"))","v":""},{"$f":"IF(Calculation!V44=\"\",\"\",IF(Calculation!V44=\"NG\",\"-\",\"+\"))","v":""},{"$f":"IF(Calculation!W44=\"\",\"\",IF(Calculation!W44=\"NG\",\"-\",\"+\"))","v":""},{"$f":"IF(Calculation!X44=\"\",\"\",IF(Calculation!X44=\"NG\",\"-\",\"+\"))","v":""},{"$f":"IF(Calculation!Y44=\"\",\"\",IF(Calculation!Y44=\"NG\",\"-\",\"+\"))","v":""},{"$f":"IF(Calculation!Z44=\"\",\"\",IF(Calculation!Z44=\"NG\",\"-\",\"+\"))","v":""},"",{"$f":"Calculation!AA44","v":""}]
[null,null,16,{"$f":"Calculation!O20","v":""},{"$f":"Calculation!Q20","v":""},{"$f":"IF(Calculation!R20=\"\",\"\",IF(Calculation!R20=\"NG\",\"-\",\"+\"))","v":""},{"$f":"IF(Calculation!S20=\"\",\"\",IF(Calculation!S20=\"NG\",\"-\",\"+\"))","v":""},{"$f":"IF(Calculation!T20=\"\",\"\",IF(Calculation!T20=\"NG\",\"-\",\"+\"))","v":""},{"$f":"IF(Calculation!U20=\"\",\"\",IF(Calculation!U20=\"NG\",\"-\",\"+\"))","v":""},{"$f":"IF(Calculation!V20=\"\",\"\",IF(Calculation!V20=\"NG\",\"-\",\"+\"))","v":""},{"$f":"IF(Calculation!W20=\"\",\"\",IF(Calculation!W20=\"NG\",\"-\",\"+\"))","v":""},{"$f":"IF(Calculation!X20=\"\",\"\",IF(Calculation!X20=\"NG\",\"-\",\"+\"))","v":""},{"$f":"IF(Calculation!Y20=\"\",\"\",IF(Calculation!Y20=\"NG\",\"-\",\"+\"))","v":""},{"$f":"IF(Calculation!Z20=\"\",\"\",IF(Calculation!Z20=\"NG\",\"-\",\"+\"))","v":""},"",{"$f":"Calculation!AA20","v":""},null,41,{"$f":"Calculation!O45","v":""},{"$f":"Calculation!Q45","v":""},{"$f":"IF(Calculation!R45=\"\",\"\",IF(Calculation!R45=\"NG\",\"-\",\"+\"))","v":""},{"$f":"IF(Calculation!S45=\"\",\"\",IF(Calculation!S45=\"NG\",\"-\",\"+\"))","v":""},{"$f":"IF(Calculation!T45=\"\",\"\",IF(Calculation!T45=\"NG\",\"-\",\"+\"))","v":""},{"$f":"IF(Calculation!U45=\"\",\"\",IF(Calculation!U45=\"NG\",\"-\",\"+\"))","v":""},{"$f":"IF(Calculation!V45=\"\",\"\",IF(Calculation!V45=\"NG\",\"-\",\"+\"))","v":""},{"$f":"IF(Calculation!W45=\"\",\"\",IF(Calculation!W45=\"NG\",\"-\",\"+\"))","v":""},{"$f":"IF(Calculation!X45=\"\",\"\",IF(Calculation!X45=\"NG\",\"-\",\"+\"))","v":""},{"$f":"IF(Calculation!Y45=\"\",\"\",IF(Calculation!Y45=\"NG\",\"-\",\"+\"))","v":""},{"$f":"IF(Calculation!Z45=\"\",\"\",IF(Calculation!Z45=\"NG\",\"-\",\"+\"))","v":""},"",{"$f":"Calculation!AA45","v":""}]
[null,null,17,{"$f":"Calculation!O21","v":""},{"$f":"Calculation!Q21","v":""},{"$f":"IF(Calculation!R21=\"\",\"\",IF(Calculation!R21=\"NG\",\"-\",\"+\"))","v":""},{"$f":"IF(Calculation!S21=\"\",\"\",IF(Calculation!S21=\"NG\",\"-\",\"+\"))","v":""},{"$f":"IF(Calculation!T21=\"\",\"\",IF(Calculation!T21=\"NG\",\"-\",\"+\"))","v":""},{"$f":"IF(Calculation!U21=\"\",\"\",IF(Calculation!U21=\"NG\",\"-\",\"+\"))","v":""},{"$f":"IF(Calculation!V21=\"\",\"\",IF(Calculation!V21=\"NG\",\"-\",\"+\"))","v":""},{"$f":"IF(Calculation!W21=\"\",\"\",IF(Calculation!W21=\"NG\",\"-\",\"+\"))","v":""},{"$f":"IF(Calculation!X21=\"\",\"\",IF(Calculation!X21=\"NG\",\"-\",\"+\"))","v":""},{"$f":"IF(Calculation!Y21=\"\",\"\",IF(Calculation!Y21=\"NG\",\"-\",\"+\"))","v":""},{"$f":"IF(Calculation!Z21=\"\",\"\",IF(Calculation!Z21=\"NG\",\"-\",\"+\"))","v":""},"",{"$f":"Calculation!AA21","v":""},null,42,{"$f":"Calculation!O46","v":""},{"$f":"Calculation!Q46","v":""},{"$f":"IF(Calculation!R46=\"\",\"\",IF(Calculation!R46=\"NG\",\"-\",\"+\"))","v":""},{"$f":"IF(Calculation!S46=\"\",\"\",IF(Calculation!S46=\"NG\",\"-\",\"+\"))","v":""},{"$f":"IF(Calculation!T46=\"\",\"\",IF(Calculation!T46=\"NG\",\"-\",\"+\"))","v":""},{"$f":"IF(Calculation!U46=\"\",\"\",IF(Calculation!U46=\"NG\",\"-\",\"+\"))","v":""},{"$f":"IF(Calculation!V46=\"\",\"\",IF(Calculation!V46=\"NG\",\"-\",\"+\"))","v":""},{"$f":"IF(Calculation!W46=\"\",\"\",IF(Calculation!W46=\"NG\",\"-\",\"+\"))","v":""},{"$f":"IF(Calculation!X46=\"\",\"\",IF(Calculation!X46=\"NG\",\"-\",\"+\"))","v":""},{"$f":"IF(Calculation!Y46=\"\",\"\",IF(Calculation!Y46=\"NG\",\"-\",\"+\"))","v":""},{"$f":"IF(Calculation!Z46=\"\",\"\",IF(Calculation!Z46=\"NG\",\"-\",\"+\"))","v":""},"",{"$f":"Calculation!AA46","v":""}]
[null,null,18,{"$f":"Calculation!O22","v":""},{"$f":"Calculation!Q22","v":""},{"$f":"IF(Calculation!R22=\"\",\"\",IF(Calculation!R22=\"NG\",\"-\",\"+\"))","v":""},{"$f":"IF(Calculation!S22=\"\",\"\",IF(Calculation!S22=\"NG\",\"-\",\"+\"))","v":""},{"$f":"IF(Calculation!T22=\"\",\"\",IF(Calculation!T22=\"NG\",\"-\",\"+\"))","v":""},{"$f":"IF(Calculation!U22=\"\",\"\",IF(Calculation!U22=\"NG\",\"-\",\"+\"))","v":""},{"$f":"IF(Calculation!V22=\"\",\"\",IF(Calculation!V22=\"NG\",\"-\",\"+\"))","v":""},{"$f":"IF(Calculation!W22=\"\",\"\",IF(Calculation!W22=\"NG\",\"-\",\"+\"))","v":""},{"$f":"IF(Calculation!X22=\"\",\"\",IF(Calculation!X22=\"NG\",\"-\",\"+\"))","v":""},{"$f":"IF(Calculation!Y22=\"\",\"\",IF(Calculation!Y22=\"NG\",\"-\",\"+\"))","v":""},{"$f":"IF(Calculation!Z22=\"\",\"\",IF(Calculation!Z22=\"NG\",\"-\",\"+\"))","v":""},"",{"$f":"Calculation!AA22","v":""},null,43,{"$f":"Calculation!O47","v":""},{"$f":"Calculation!Q47","v":""},{"$f":"IF(Calculation!R47=\"\",\"\",IF(Calculation!R47=\"NG\",\"-\",\"+\"))","v":""},{"$f":"IF(Calculation!S47=\"\",\"\",IF(Calculation!S47=\"NG\",\"-\",\"+\"))","v":""},{"$f":"IF(Calculation!T47=\"\",\"\",IF(Calculation!T47=\"NG\",\"-\",\"+\"))","v":""},{"$f":"IF(Calculation!U47=\"\",\"\",IF(Calculation!U47=\"NG\",\"-\",\"+\"))","v":""},{"$f":"IF(Calculation!V47=\"\",\"\",IF(Calculation!V47=\"NG\",\"-\",\"+\"))","v":""},{"$f":"IF(Calculation!W47=\"\",\"\",IF(Calculation!W47=\"NG\",\"-\",\"+\"))","v":""},{"$f":"IF(Calculation!X47=\"\",\"\",IF(Calculation!X47=\"NG\",\"-\",\"+\"))","v":""},{"$f":"IF(Calculation!Y47=\"\",\"\",IF(Calculation!Y47=\"NG\",\"-\",\"+\"))","v":""},{"$f":"IF(Calculation!Z47=\"\",\"\",IF(Calculation!Z47=\"NG\",\"-\",\"+\"))","v":""},"",{"$f":"Calculation!AA47","v":""}]
[null,null,19,{"$f":"Calculation!O23","v":""},{"$f":"Calculation!Q23","v":""},{"$f":"IF(Calculation!R23=\"\",\"\",IF(Calculation!R23=\"NG\",\"-\",\"+\"))","v":""},{"$f":"IF(Calculation!S23=\"\",\"\",IF(Calculation!S23=\"NG\",\"-\",\"+\"))","v":""},{"$f":"IF(Calculation!T23=\"\",\"\",IF(Calculation!T23=\"NG\",\"-\",\"+\"))","v":""},{"$f":"IF(Calculation!U23=\"\",\"\",IF(Calculation!U23=\"NG\",\"-\",\"+\"))","v":""},{"$f":"IF(Calculation!V23=\"\",\"\",IF(Calculation!V23=\"NG\",\"-\",\"+\"))","v":""},{"$f":"IF(Calculation!W23=\"\",\"\",IF(Calculation!W23=\"NG\",\"-\",\"+\"))","v":""},{"$f":"IF(Calculation!X23=\"\",\"\",IF(Calculation!X23=\"NG\",\"-\",\"+\"))","v":""},{"$f":"IF(Calculation!Y23=\"\",\"\",IF(Calculation!Y23=\"NG\",\"-\",\"+\"))","v":""},{"$f":"IF(Calculation!Z23=\"\",\"\",IF(Calculation!Z23=\"NG\",\"-\",\"+\"))","v":""},"",{"$f":"Calculation!AA23","v":""},null,44,{"$f":"Calculation!O48","v":""},{"$f":"Calculation!Q48","v":""},{"$f":"IF(Calculation!R48=\"\",\"\",IF(Calculation!R48=\"NG\",\"-\",\"+\"))","v":""},{"$f":"IF(Calculation!S48=\"\",\"\",IF(Calculation!S48=\"NG\",\"-\",\"+\"))","v":""},{"$f":"IF(Calculation!T48=\"\",\"\",IF(Calculation!T48=\"NG\",\"-\",\"+\"))","v":""},{"$f":"IF(Calculation!U48=\"\",\"\",IF(Calculation!U48=\"NG\",\"-\",\"+\"))","v":""},{"$f":"IF(Calculation!V48=\"\",\"\",IF(Calculation!V48=\"NG\",\"-\",\"+\"))","v":""},{"$f":"IF(Calculation!W48=\"\",\"\",IF(Calculation!W48=\"NG\",\"-\",\"+\"))","v":""},{"$f":"IF(Calculation!X48=\"\",\"\",IF(Calculation!X48=\"NG\",\"-\",\"+\"))","v":""},{"$f":"IF(Calculation!Y48=\"\",\"\",IF(Calculation!Y48=\"NG\",\"-\",\"+\"))","v":""},{"$f":"IF(Calculation!Z48=\"\",\"\",IF(Calculation!Z48=\"NG\",\"-\",\"+\"))","v":""},"",{"$f":"Calculation!AA48","v":""}]
[null,null,20,{"$f":"Calculation!O24","v":""},{"$f":"Calculation!Q24","v":""},{"$f":"IF(Calculation!R24=\"\",\"\",IF(Calculation!R24=\"NG\",\"-\",\"+\"))","v":""},{"$f":"IF(Calculation!S24=\"\",\"\",IF(Calculation!S24=\"NG\",\"-\",\"+\"))","v":""},{"$f":"IF(Calculation!T24=\"\",\"\",IF(Calculation!T24=\"NG\",\"-\",\"+\"))","v":""},{"$f":"IF(Calculation!U24=\"\",\"\",IF(Calculation!U24=\"NG\",\"-\",\"+\"))","v":""},{"$f":"IF(Calculation!V24=\"\",\"\",IF(Calculation!V24=\"NG\",\"-\",\"+\"))","v":""},{"$f":"IF(Calculation!W24=\"\",\"\",IF(Calculation!W24=\"NG\",\"-\",\"+\"))","v":""},{"$f":"IF(Calculation!X24=\"\",\"\",IF(Calculation!X24=\"NG\",\"-\",\"+\"))","v":""},{"$f":"IF(Calculation!Y24=\"\",\"\",IF(Calculation!Y24=\"NG\",\"-\",\"+\"))","v":""},{"$f":"IF(Calculation!Z24=\"\",\"\",IF(Calculation!Z24=\"NG\",\"-\",\"+\"))","v":""},"",{"$f":"Calculation!AA24","v":""},null,45,{"$f":"Calculation!O49","v":""},{"$f":"Calculation!Q49","v":""},{"$f":"IF(Calculation!R49=\"\",\"\",IF(Calculation!R49=\"NG\",\"-\",\"+\"))","v":""},{"$f":"IF(Calculation!S49=\"\",\"\",IF(Calculation!S49=\"NG\",\"-\",\"+\"))","v":""},{"$f":"IF(Calculation!T49=\"\",\"\",IF(Calculation!T49=\"NG\",\"-\",\"+\"))","v":""},{"$f":"IF(Calculation!U49=\"\",\"\",IF(Calculation!U49=\"NG\",\"-\",\"+\"))","v":""},{"$f":"IF(Calculation!V49=\"\",\"\",IF(Calculation!V49=\"NG\",\"-\",\"+\"))","v":""},{"$f":"IF(Calculation!W49=\"\",\"\",IF(Calculation!W49=\"NG\",\"-\",\"+\"))","v":""},{"$f":"IF(Calculation!X49=\"\",\"\",IF(Calculation!X49=\"NG\",\"-\",\"+\"))","v":""},{"$f":"IF(Calculation!Y49=\"\",\"\",IF(Calculation!Y49=\"NG\",\"-\",\"+\"))","v":""},{"$f":"IF(Calculation!Z49=\"\",\"\",IF(Calculation!Z49=\"NG\",\"-\",\"+\"))","v":""},"",{"$f":"Calculation!AA49","v":""}]
[null,null,21,{"$f":"Calculation!O25","v":""},{"$f":"Calculation!Q25","v":""},{"$f":"IF(Calculation!R25=\"\",\"\",IF(Calculation!R25=\"NG\",\"-\",\"+\"))","v":""},{"$f":"IF(Calculation!S25=\"\",\"\",IF(Calculation!S25=\"NG\",\"-\",\"+\"))","v":""},{"$f":"IF(Calculation!T25=\"\",\"\",IF(Calculation!T25=\"NG\",\"-\",\"+\"))","v":""},{"$f":"IF(Calculation!U25=\"\",\"\",IF(Calculation!U25=\"NG\",\"-\",\"+\"))","v":""},{"$f":"IF(Calculation!V25=\"\",\"\",IF(Calculation!V25=\"NG\",\"-\",\"+\"))","v":""},{"$f":"IF(Calculation!W25=\"\",\"\",IF(Calculation!W25=\"NG\",\"-\",\"+\"))","v":""},{"$f":"IF(Calculation!X25=\"\",\"\",IF(Calculation!X25=\"NG\",\"-\",\"+\"))","v":""},{"$f":"IF(Calculation!Y25=\"\",\"\",IF(Calculation!Y25=\"NG\",\"-\",\"+\"))","v":""},{"$f":"IF(Calculation!Z25=\"\",\"\",IF(Calculation!Z25=\"NG\",\"-\",\"+\"))","v":""},"",{"$f":"Calculation!AA25","v":""},null,46,{"$f":"Calculation!O50","v":""},{"$f":"Calculation!Q50","v":""},{"$f":"IF(Calculation!R50=\"\",\"\",IF(Calculation!R50=\"NG\",\"-\",\"+\"))","v":""},{"$f":"IF(Calculation!S50=\"\",\"\",IF(Calculation!S50=\"NG\",\"-\",\"+\"))","v":""},{"$f":"IF(Calculation!T50=\"\",\"\",IF(Calculation!T50=\"NG\",\"-\",\"+\"))","v":""},{"$f":"IF(Calculation!U50=\"\",\"\",IF(Calculation!U50=\"NG\",\"-\",\"+\"))","v":""},{"$f":"IF(Calculation!V50=\"\",\"\",IF(Calculation!V50=\"NG\",\"-\",\"+\"))","v":""},{"$f":"IF(Calculation!W50=\"\",\"\",IF(Calculation!W50=\"NG\",\"-\",\"+\"))","v":""},{"$f":"IF(Calculation!X50=\"\",\"\",IF(Calculation!X50=\"NG\",\"-\",\"+\"))","v":""},{"$f":"IF(Calculation!Y50=\"\",\"\",IF(Calculation!Y50=\"NG\",\"-\",\"+\"))","v":""},{"$f":"IF(Calculation!Z50=\"\",\"\",IF(Calculation!Z50=\"NG\",\"-\",\"+\"))","v":""},"",{"$f":"Calculation!AA50","v":""}]
[null,null,22,{"$f":"Calculation!O26","v":""},{"$f":"Calculation!Q26","v":""},{"$f":"IF(Calculation!R26=\"\",\"\",IF(Calculation!R26=\"NG\",\"-\",\"+\"))","v":""},{"$f":"IF(Calculation!S26=\"\",\"\",IF(Calculation!S26=\"NG\",\"-\",\"+\"))","v":""},{"$f":"IF(Calculation!T26=\"\",\"\",IF(Calculation!T26=\"NG\",\"-\",\"+\"))","v":""},{"$f":"IF(Calculation!U26=\"\",\"\",IF(Calculation!U26=\"NG\",\"-\",\"+\"))","v":""},{"$f":"IF(Calculation!V26=\"\",\"\",IF(Calculation!V26=\"NG\",\"-\",\"+\"))","v":""},{"$f":"IF(Calculation!W26=\"\",\"\",IF(Calculation!W26=\"NG\",\"-\",\"+\"))","v":""},{"$f":"IF(Calculation!X26=\"\",\"\",IF(Calculation!X26=\"NG\",\"-\",\"+\"))","v":""},{"$f":"IF(Calculation!Y26=\"\",\"\",IF(Calculation!Y26=\"NG\",\"-\",\"+\"))","v":""},{"$f":"IF(Calculation!Z26=\"\",\"\",IF(Calculation!Z26=\"NG\",\"-\",\"+\"))","v":""},"",{"$f":"Calculation!AA26","v":""},null,47,{"$f":"Calculation!O51","v":""},{"$f":"Calculation!Q51","v":""},{"$f":"IF(Calculation!R51=\"\",\"\",IF(Calculation!R51=\"NG\",\"-\",\"+\"))","v":""},{"$f":"IF(Calculation!S51=\"\",\"\",IF(Calculation!S51=\"NG\",\"-\",\"+\"))","v":""},{"$f":"IF(Calculation!T51=\"\",\"\",IF(Calculation!T51=\"NG\",\"-\",\"+\"))","v":""},{"$f":"IF(Calculation!U51=\"\",\"\",IF(Calculation!U51=\"NG\",\"-\",\"+\"))","v":""},{"$f":"IF(Calculation!V51=\"\",\"\",IF(Calculation!V51=\"NG\",\"-\",\"+\"))","v":""},{"$f":"IF(Calculation!W51=\"\",\"\",IF(Calculation!W51=\"NG\",\"-\",\"+\"))","v":""},{"$f":"IF(Calculation!X51=\"\",\"\",IF(Calculation!X51=\"NG\",\"-\",\"+\"))","v":""},{"$f":"IF(Calculation!Y51=\"\",\"\",IF(Calculation!Y51=\"NG\",\"-\",\"+\"))","v":""},{"$f":"IF(Calculation!Z51=\"\",\"\",IF(Calculation!Z51=\"NG\",\"-\",\"+\"))","v":""},"",{"$f":"Calculation!AA51","v":""}]
[null,null,23,{"$f":"Calculation!O27","v":""},{"$f":"Calculation!Q27","v":""},{"$f":"IF(Calculation!R27=\"\",\"\",IF(Calculation!R27=\"NG\",\"-\",\"+\"))","v":""},{"$f":"IF(Calculation!S27=\"\",\"\",IF(Calculation!S27=\"NG\",\"-\",\"+\"))","v":""},{"$f":"IF(Calculation!T27=\"\",\"\",IF(Calculation!T27=\"NG\",\"-\",\"+\"))","v":""},{"$f":"IF(Calculation!U27=\"\",\"\",IF(Calculation!U27=\"NG\",\"-\",\"+\"))","v":""},{"$f":"IF(Calculation!V27=\"\",\"\",IF(Calculation!V27=\"NG\",\"-\",\"+\"))","v":""},{"$f":"IF(Calculation!W27=\"\",\"\",IF(Calculation!W27=\"NG\",\"-\",\"+\"))","v":""},{"$f":"IF(Calculation!X27=\"\",\"\",IF(Calculation!X27=\"NG\",\"-\",\"+\"))","v":""},{"$f":"IF(Calculation!Y27=\"\",\"\",IF(Calculation!Y27=\"NG\",\"-\",\"+\"))","v":""},{"$f":"IF(Calculation!Z27=\"\",\"\",IF(Calculation!Z27=\"NG\",\"-\",\"+\"))","v":""},"",{"$f":"Calculation!AA27","v":""},null,48,{"$f":"Calculation!O52","v":""},{"$f":"Calculation!Q52","v":""},{"$f":"IF(Calculation!R52=\"\",\"\",IF(Calculation!R52=\"NG\",\"-\",\"+\"))","v":""},{"$f":"IF(Calculation!S52=\"\",\"\",IF(Calculation!S52=\"NG\",\"-\",\"+\"))","v":""},{"$f":"IF(Calculation!T52=\"\",\"\",IF(Calculation!T52=\"NG\",\"-\",\"+\"))","v":""},{"$f":"IF(Calculation!U52=\"\",\"\",IF(Calculation!U52=\"NG\",\"-\",\"+\"))","v":""},{"$f":"IF(Calculation!V52=\"\",\"\",IF(Calculation!V52=\"NG\",\"-\",\"+\"))","v":""},{"$f":"IF(Calculation!W52=\"\",\"\",IF(Calculation!W52=\"NG\",\"-\",\"+\"))","v":""},{"$f":"IF(Calculation!X52=\"\",\"\",IF(Calculation!X52=\"NG\",\"-\",\"+\"))","v":""},{"$f":"IF(Calculation!Y52=\"\",\"\",IF(Calculation!Y52=\"NG\",\"-\",\"+\"))","v":""},{"$f":"IF(Calculation!Z52=\"\",\"\",IF(Calculation!Z52=\"NG\",\"-\",\"+\"))","v":""},"",{"$f":"Calculation!AA52","v":""}]
[null,null,24,{"$f":"Calculation!O28","v":""},{"$f":"Calculation!Q28","v":""},{"$f":"IF(Calculation!R28=\"\",\"\",IF(Calculation!R28=\"NG\",\"-\",\"+\"))","v":""},{"$f":"IF(Calculation!S28=\"\",\"\",IF(Calculation!S28=\"NG\",\"-\",\"+\"))","v":""},{"$f":"IF(Calculation!T28=\"\",\"\",IF(Calculation!T28=\"NG\",\"-\",\"+\"))","v":""},{"$f":"IF(Calculation!U28=\"\",\"\",IF(Calculation!U28=\"NG\",\"-\",\"+\"))","v":""},{"$f":"IF(Calculation!V28=\"\",\"\",IF(Calculation!V28=\"NG\",\"-\",\"+\"))","v":""},{"$f":"IF(Calculation!W28=\"\",\"\",IF(Calculation!W28=\"NG\",\"-\",\"+\"))","v":""},{"$f":"IF(Calculation!X28=\"\",\"\",IF(Calculation!X28=\"NG\",\"-\",\"+\"))","v":""},{"$f":"IF(Calculation!Y28=\"\",\"\",IF(Calculation!Y28=\"NG\",\"-\",\"+\"))","v":""},{"$f":"IF(Calculation!Z28=\"\",\"\",IF(Calculation!Z28=\"NG\",\"-\",\"+\"))","v":""},"",{"$f":"Calculation!AA28","v":""},null,49,{"$f":"Calculation!O53","v":""},{"$f":"Calculation!Q53","v":""},{"$f":"IF(Calculation!R53=\"\",\"\",IF(Calculation!R53=\"NG\",\"-\",\"+\"))","v":""},{"$f":"IF(Calculation!S53=\"\",\"\",IF(Calculation!S53=\"NG\",\"-\",\"+\"))","v":""},{"$f":"IF(Calculation!T53=\"\",\"\",IF(Calculation!T53=\"NG\",\"-\",\"+\"))","v":""},{"$f":"IF(Calculation!U53=\"\",\"\",IF(Calculation!U53=\"NG\",\"-\",\"+\"))","v":""},{"$f":"IF(Calculation!V53=\"\",\"\",IF(Calculation!V53=\"NG\",\"-\",\"+\"))","v":""},{"$f":"IF(Calculation!W53=\"\",\"\",IF(Calculation!W53=\"NG\",\"-\",\"+\"))","v":""},{"$f":"IF(Calculation!X53=\"\",\"\",IF(Calculation!X53=\"NG\",\"-\",\"+\"))","v":""},{"$f":"IF(Calculation!Y53=\"\",\"\",IF(Calculation!Y53=\"NG\",\"-\",\"+\"))","v":""},{"$f":"IF(Calculation!Z53=\"\",\"\",IF(Calculation!Z53=\"NG\",\"-\",\"+\"))","v":""},"",{"$f":"Calculation!AA53","v":""}]
[null,null,25,{"$f":"Calculation!O29","v":""},{"$f":"Calculation!Q29","v":""},{"$f":"IF(Calculation!R29=\"\",\"\",IF(Calculation!R29=\"NG\",\"-\",\"+\"))","v":""},{"$f":"IF(Calculation!S29=\"\",\"\",IF(Calculation!S29=\"NG\",\"-\",\"+\"))","v":""},{"$f":"IF(Calculation!T29=\"\",\"\",IF(Calculation!T29=\"NG\",\"-\",\"+\"))","v":""},{"$f":"IF(Calculation!U29=\"\",\"\",IF(Calculation!U29=\"NG\",\"-\",\"+\"))","v":""},{"$f":"IF(Calculation!V29=\"\",\"\",IF(Calculation!V29=\"NG\",\"-\",\"+\"))","v":""},{"$f":"IF(Calculation!W29=\"\",\"\",IF(Calculation!W29=\"NG\",\"-\",\"+\"))","v":""},{"$f":"IF(Calculation!X29=\"\",\"\",IF(Calculation!X29=\"NG\",\"-\",\"+\"))","v":""},{"$f":"IF(Calculation!Y29=\"\",\"\",IF(Calculation!Y29=\"NG\",\"-\",\"+\"))","v":""},{"$f":"IF(Calculation!Z29=\"\",\"\",IF(Calculation!Z29=\"NG\",\"-\",\"+\"))","v":""},"",{"$f":"Calculation!AA29","v":""},null,50,{"$f":"Calculation!O54","v":""},{"$f":"Calculation!Q54","v":""},{"$f":"IF(Calculation!R54=\"\",\"\",IF(Calculation!R54=\"NG\",\"-\",\"+\"))","v":""},{"$f":"IF(Calculation!S54=\"\",\"\",IF(Calculation!S54=\"NG\",\"-\",\"+\"))","v":""},{"$f":"IF(Calculation!T54=\"\",\"\",IF(Calculation!T54=\"NG\",\"-\",\"+\"))","v":""},{"$f":"IF(Calculation!U54=\"\",\"\",IF(Calculation!U54=\"NG\",\"-\",\"+\"))","v":""},{"$f":"IF(Calculation!V54=\"\",\"\",IF(Calculation!V54=\"NG\",\"-\",\"+\"))","v":""},{"$f":"IF(Calculation!W54=\"\",\"\",IF(Calculation!W54=\"NG\",\"-\",\"+\"))","v":""},{"$f":"IF(Calculation!X54=\"\",\"\",IF(Calculation!X54=\"NG\",\"-\",\"+\"))","v":""},{"$f":"IF(Calculation!Y54=\"\",\"\",IF(Calculation!Y54=\"NG\",\"-\",\"+\"))","v":""},{"$f":"IF(Calculation!Z54=\"\",\"\",IF(Calculation!Z54=\"NG\",\"-\",\"+\"))","v":""},"",{"$f":"Calculation!AA54","v":""}]
[]
[]
[]
[]
[]
[]
[]
[]
[]
[]
[]
[]
[]
[]
[]
[]
[]
[]
[]
[]
[]
[]
[]
[]
[]
[]
[]
[]
[null,null,"Result",null,null,null,null,null,null,null,null,null,0.2,null,null,null,null,null,0.3,null,null,null,null,null,null,null,"Capability"]
[null,null,{"$f":"IFERROR(\"%gAttrib = \" & ROUND(S81,2),\"%gAttrib\")","v":"%gAttrib"},null,null,null,{"$f":"IF(S81=\"\",\"\",IF(S81>30,\"VAL1\",IF(S81>20,\"VAL2\",S81)))","v":""},null,null,null,null,null,{"$f":"IF(S81=\"\",\"\",IF(S81>30,\"VAL\",S81))","v":""},null,null,null,null,null,{"$f":"Calculation!AR21","v":""},null,null,null,null,null,null,null,{"$f":"IF(G81=\"\",\"\",IF(G81<20,\"Approved\",\"NG\"))","v":""}]
[null,null,null,null,null,null,null,null,null,null,null,null,null,null,null,null,null,null,null,null,null,null,null,null," "]
[]
[]
[]
[]
["Please enter the collected results into the register \"Values\""]

{"sheet":"Values","index":2,"n_rows":54,"n_cols":12,"rows_kept":54,"cut":false,"hidden":true,"merged":[[1,1,1,2]]}
[]
[null,"Values"]
[]
[null,"Nr.","Ref. Value",{"$f":"IF($F$12=\"manuell\",\"XA1\",\"X1\")","v":"X1"},{"$f":"IF($F$12=\"manuell\",\"XA2\",\"X2\")","v":"X2"},{"$f":"IF($F$12=\"manuell\",\"XA3\",\"X3\")","v":"X3"},{"$f":"IF($F$12=\"manuell\",\"XB1\",\"X4\")","v":"X4"},{"$f":"IF($F$12=\"manuell\",\"XB2\",\"X5\")","v":"X5"},{"$f":"IF($F$12=\"manuell\",\"XB3\",\"X6\")","v":"X6"},{"$f":"IF($F$12=\"manuell\",\"XC1\",\"X7\")","v":"X7"},{"$f":"IF($F$12=\"manuell\",\"XC2\",\"X8\")","v":"X8"},{"$f":"IF($F$12=\"manuell\",\"XC3\",\"X9\")","v":"X9"}]
[null,{"$f":"IF(C5=\"\",\"\",1)","v":""}]
[null,{"$f":"IF(C6=\"\",\"\",B5+1)","v":""}]
[null,{"$f":"IF(C7=\"\",\"\",B6+1)","v":""}]
[null,""]
[null,""]
[null,""]
[null,""]
[null,""]
[null,""]
[null,""]
[null,""]
[null,""]
[null,""]
[null,""]
[null,""]
[null,""]
[null,""]
[null,""]
[null,""]
[null,""]
[null,""]
[null,""]
[null,""]
[null,""]
[null,""]
[null,""]
[null,""]
[null,""]
[null,""]
[null,""]
[null,""]
[null,""]
[null,""]
[null,""]
[null,""]
[null,""]
[null,""]
[null,""]
[null,""]
[null,""]
[null,""]
[null,""]
[null,""]
[null,""]
[null,""]
[null,""]
[null,""]
[null,""]
[null,""]
[null,""]

{"sheet":"Graphics","index":3,"n_rows":0,"n_cols":0,"rows_kept":0,"cut":false,"hidden":false,"merged":[[5,17,14,17],[5,18,14,18],[15,17,15,18],[22,17,31,17],[22,18,31,18]]}

{"sheet":"Calculation","index":4,"n_rows":54,"n_cols":68,"rows_kept":54,"cut":false,"hidden":true,"merged":[[1,46,2,50],[1,1,2,7],[1,14,2,18],[21,46,21,47],[2,9,2,12],[3,47,3,48],[4,43,5,43],[6,43,7,43],[8,43,9,43],[10,43,11,43],[12,43,13,43],[40,42,40,43],[3,51,3,52],[14,44,15,44],[22,46,23,49],[3,49,3,50],[24,42,24,43]]}
[]
[null,"Values and Results",null,null,null,null,null,null,null,null,null,null,null,null,"Values and Results (Sorted)",null,null,null,null,null,null,null,null,null,null,null,null,null,null,null,null,null,null,null,null,null,null,null,null,null,null,null,null,null,null,null,"Class and Histogram calculations"]
[null,null,null,null,null,null,null,null,null,null,null,null,null,null,null,null,null,null,null,null,null,null,null,null,null,null,null,null,null,null,null,null,null,null,null,null,null,null,null,null,null,null,null,null,null,null,null,null,null,null,null,null,null,null,null,"Nr","USL","LSL","d1u","d1l","d2u","d2l","d3u","d3l","d4u","d4l","d5u","d5l"]
[null,"Rank","n","Ref. Value",{"$f":"IF($F$11=\"manuell\",\"XA1\",\"X1\")","v":"X1"},{"$f":"IF($F$11=\"manuell\",\"XA2\",\"X2\")","v":"X2"},{"$f":"IF($F$11=\"manuell\",\"XA3\",\"X3\")","v":"X3"},{"$f":"IF($F$11=\"manuell\",\"XB1\",\"X4\")","v":"X4"},{"$f":"IF($F$11=\"manuell\",\"XB2\",\"X5\")","v":"X5"},{"$f":"IF($F$11=\"manuell\",\"XB3\",\"X6\")","v":"X6"},{"$f":"IF($F$11=\"manuell\",\"XC1\",\"X7\")","v":"X7"},{"$f":"IF($F$11=\"manuell\",\"XC2\",\"X8\")","v":"X8"},{"$f":"IF($F$11=\"manuell\",\"XC3\",\"X9\")","v":"X9"},null,"n","Rank","Ref. Value",{"$f":"IF($F$11=\"manuell\",\"XA1\",\"X1\")","v":"X1"},{"$f":"IF($F$11=\"manuell\",\"XA2\",\"X2\")","v":"X2"},{"$f":"IF($F$11=\"manuell\",\"XA3\",\"X3\")","v":"X3"},{"$f":"IF($F$11=\"manuell\",\"XB1\",\"X4\")","v":"X4"},{"$f":"IF($F$11=\"manuell\",\"XB2\",\"X5\")","v":"X5"},{"$f":"IF($F$11=\"manuell\",\"XB3\",\"X6\")","v":"X6"},{"$f":"IF($F$11=\"manuell\",\"XC1\",\"X7\")","v":"X7"},{"$f":"IF($F$11=\"manuell\",\"XC2\",\"X8\")","v":"X8"},{"$f":"IF($F$11=\"manuell\",\"XC3\",\"X9\")","v":"X9"},null,null,"Green","Yellow","Red",null,null,null,null,null,null,"Rank","Result","Border values",null,"Rank","Border values","uncertainty ranges",null,null,"Classes","Values per class (Good)",null,"Values per class (Uncertain)",null,"Values per class (Bad)",null,"Sum",null,1,{"$f":"Visualization!$S$20","v":0},{"$f":"Visualization!$S$21","v":0},{"$f":"Calculation!$AQ$5","v":""},{"$f":"Calculation!$AQ$6","v":""},{"$f":"Calculation!$AQ$7","v":""},{"$f":"Calculation!$AQ$8","v":""},{"$f":"Calculation!$AQ$9","v":""},{"$f":"Calculation!$AQ$10","v":""},{"$f":"Calculation!$AQ$11","v":""},{"$f":"Calculation!$AQ$12","v":""},{"$f":"Calculation!$AQ$13","v":""},{"$f":"Calculation!$AQ$14","v":""}]
[null,{"$f":"IF(D5=\"\",\"\",RANK(D5,$D$5:$D$54))","v":""},1,{"$f":"IF(Values!C5=\"\",\"\",Values!C5)","v":""},{"$f":"IF(Values!D5=\"\",\"\",Values!D5)","v":""},{"$f":"IF(Values!E5=\"\",\"\",Values!E5)","v":""},{"$f":"IF(Values!F5=\"\",\"\",Values!F5)","v":""},{"$f":"IF(Values!G5=\"\",\"\",Values!G5)","v":""},{"$f":"IF(Values!H5=\"\",\"\",Values!H5)","v":""},{"$f":"IF(Values!I5=\"\",\"\",Values!I5)","v":""},{"$f":"IF(Values!J5=\"\",\"\",Values!J5)","v":""},{"$f":"IF(Values!K5=\"\",\"\",Values!K5)","v":""},{"$f":"IF(Values!L5=\"\",\"\",Values!L5)","v":""},null,{"$f":"IF(B5=\"\",\"\",VLOOKUP(P5,$B$5:$D$54,2,FALSE))","v":""},1,{"$f":"IF(O5=\"\",\"\",VLOOKUP(P5,$B$5:$D$54,3,FALSE))","v":""},{"$f":"IF(O5=\"\",\"\",VLOOKUP(P5,$B$5:$M$54,4,FALSE))","v":""},{"$f":"IF(O5=\"\",\"\",VLOOKUP(P5,$B$5:$M$54,5,FALSE))","v":""},{"$f":"IF(O5=\"\",\"\",VLOOKUP(P5,$B$5:$M$54,6,FALSE))","v":""},{"$f":"IF(O5=\"\",\"\",VLOOKUP(P5,$B$5:$M$54,7,FALSE))","v":""},{"$f":"IF(O5=\"\",\"\",VLOOKUP(P5,$B$5:$M$54,8,FALSE))","v":""},{"$f":"IF(O5=\"\",\"\",VLOOKUP(P5,$B$5:$M$54,9,FALSE))","v":""},{"$f":"IF(O5=\"\",\"\",VLOOKUP(P5,$B$5:$M$54,10,FALSE))","v":""},{"$f":"IF(O5=\"\",\"\",VLOOKUP(P5,$B$5:$M$54,11,FALSE))","v":""},{"$f":"IF(O5=\"\",\"\",VLOOKUP(P5,$B$5:$M$54,12,FALSE))","v":""},{"$f":"IF(AJ5=1,IF(Q5-Visualization!$S$20>Visualization!$S$21-Q5,\"USL\",\"LSL\"),\"\")","v":""},null,{"$f":"IF(COUNTIF(R5:Z5,\"OK\")=9,Q5,\"\")","v":""},{"$f":"IF(AND(COUNTIF(R5:Z5,\"OK\")<>9,COUNTIF(R5:Z5,\"NG\")<>9),Q5,\"\")","v":""},{"$f":"IF(COUNTIF(R5:Z5,\"NG\")=9,Q5,\"\")","v":""},null,{"$f":"IF(AND($AR$44>Q5,$L$4>Q6),1,0)","v":0},{"$f":"IF(AND(Q5>$AR$43,Q6>$L$3),1,0)","v":0},{"$f":"IF(AH5=AG5,1,0)","v":1},{"$f":"IF(OR(AND(AH5=0,AH4=1,AI5=1),AND(AG5=0,AG6=1,AI5=1)),1,0)","v":0},null,{"$f":"IF(AN5=\"\",\"\",RANK(AN5,$AN$5:$AN$54))","v":""},{"$f":"IF(OR(COUNTIF(R5:Z5,\"NG\")=9,COUNTIF(R5:Z5,\"OK\")=9),1,0.5)","v":0.5},{"$f":"IF(OR(AND(AM5=1,AM4=0.5),AND(AM5=1,AM6=0.5)),Q5,\"\")","v":""},null,1,{"$f":"IF(COUNTIF(AL5:AL54,AP5)=1,VLOOKUP(AP5,$AL$5:$AN$54,3,FALSE),\"\")","v":""},{"$f":"IF(AQ5=\"\",\"\",AQ5-AQ6)","v":""},null,null,{"$f":"IF(AR31=\"\",\"\",AR28-(2*AR31))","v":""},{"$f":"IF(AU5=\"\",\"\",FREQUENCY($AC$5:$AC$54,AU5))","v":""},{"$f":"AV5","v":""},{"$f":"IF(AU5=\"\",\"\",FREQUENCY($AD$5:$AD$54,AU5))","v":""},{"$f":"AX5","v":""},{"$f":"IF(AU5=\"\",\"\",FREQUENCY($AE$5:$AE$54,AU5))","v":""},{"$f":"AZ5","v":""},{"$f":"SUM((AW5,AY5,BA5))","v":0},null,2,{"$f":"Visualization!$S$20","v":0},{"$f":"Visualization!$S$21","v":0},{"$f":"Calculation!$AQ$5","v":""},{"$f":"Calculation!$AQ$6","v":""},{"$f":"Calculation!$AQ$7","v":""},{"$f":"Calculation!$AQ$8","v":""},{"$f":"Calculation!$AQ$9","v":""},{"$f":"Calculation!$AQ$10","v":""},{"$f":"Calculation!$AQ$11","v":""},{"$f":"Calculation!$AQ$12","v":""},{"$f":"Calculation!$AQ$13","v":""},{"$f":"Calculation!$AQ$14","v":""}]
[null,{"$f":"IF(D6=\"\",\"\",RANK(D6,$D$5:$D$54))","v":""},2,{"$f":"IF(Values!C6=\"\",\"\",Values!C6)","v":""},{"$f":"IF(Values!D6=\"\",\"\",Values!D6)","v":""},{"$f":"IF(Values!E6=\"\",\"\",Values!E6)","v":""},{"$f":"IF(Values!F6=\"\",\"\",Values!F6)","v":""},{"$f":"IF(Values!G6=\"\",\"\",Values!G6)","v":""},{"$f":"IF(Values!H6=\"\",\"\",Values!H6)","v":""},{"$f":"IF(Values!I6=\"\",\"\",Values!I6)","v":""},{"$f":"IF(Values!J6=\"\",\"\",Values!J6)","v":""},{"$f":"IF(Values!K6=\"\",\"\",Values!K6)","v":""},{"$f":"IF(Values!L6=\"\",\"\",Values!L6)","v":""},null,"",2,{"$f":"IF(O6=\"\",\"\",VLOOKUP(P6,$B$5:$D$54,3,FALSE))","v":""},{"$f":"IF(O6=\"\",\"\",VLOOKUP(P6,$B$5:$M$54,4,FALSE))","v":""},{"$f":"IF(O6=\"\",\"\",VLOOKUP(P6,$B$5:$M$54,5,FALSE))","v":""},{"$f":"IF(O6=\"\",\"\",VLOOKUP(P6,$B$5:$M$54,6,FALSE))","v":""},{"$f":"IF(O6=\"\",\"\",VLOOKUP(P6,$B$5:$M$54,7,FALSE))","v":""},{"$f":"IF(O6=\"\",\"\",VLOOKUP(P6,$B$5:$M$54,8,FALSE))","v":""},{"$f":"IF(O6=\"\",\"\",VLOOKUP(P6,$B$5:$M$54,9,FALSE))","v":""},{"$f":"IF(O6=\"\",\"\",VLOOKUP(P6,$B$5:$M$54,10,FALSE))","v":""},{"$f":"IF(O6=\"\",\"\",VLOOKUP(P6,$B$5:$M$54,11,FALSE))","v":""},{"$f":"IF(O6=\"\",\"\",VLOOKUP(P6,$B$5:$M$54,12,FALSE))","v":""},{"$f":"IF(AJ6=1,IF(Q6-Visualization!$S$20>Visualization!$S$21-Q6,\"USL\",\"LSL\"),\"\")","v":""},null,{"$f":"IF(COUNTIF(R6:Z6,\"OK\")=9,Q6,\"\")","v":""},{"$f":"IF(AND(COUNTIF(R6:Z6,\"OK\")<>9,COUNTIF(R6:Z6,\"NG\")<>9),Q6,\"\")","v":""},{"$f":"IF(COUNTIF(R6:Z6,\"NG\")=9,Q6,\"\")","v":""},null,{"$f":"IF(AND($AR$44>Q6,$L$4>Q7),1,0)","v":0},{"$f":"IF(AND(Q6>$AR$43,Q7>$L$3),1,0)","v":0},{"$f":"IF(AH6=AG6,1,0)","v":1},{"$f":"IF(OR(AND(AH6=0,AH5=1,AI6=1),AND(AG6=0,AG7=1,AI6=1)),1,0)","v":0},null,{"$f":"IF(AN6=\"\",\"\",RANK(AN6,$AN$5:$AN$54))","v":""},{"$f":"IF(OR(COUNTIF(R6:Z6,\"NG\")=9,COUNTIF(R6:Z6,\"OK\")=9),1,0.5)","v":0.5},"",null,2,{"$f":"IF(COUNTIF(AL6:AL55,AP6)=1,VLOOKUP(AP6,$AL$5:$AN$54,3,FALSE),\"\")","v":""},null,null,null,{"$f":"IF($AR$31=\"\",\"\",IF(AND(AU5<($AS$41*$AR$30+$AU$5),AU5>-999999999999999),AU5+$AR$31,\"\"))","v":""},{"$f":"IF(AU6=\"\",\"\",FREQUENCY($AC$5:$AC$54,AU6))","v":""},{"$f":"IF(AV6=\"\",\"\",AV6-AV5)","v":""},{"$f":"IF(AU6=\"\",\"\",FREQUENCY($AD$5:$AD$54,AU6))","v":""},{"$f":"IF(AX6=\"\",\"\",AX6-AX5)","v":""},{"$f":"IF(AU6=\"\",\"\",FREQUENCY($AE$5:$AE$54,AU6))","v":""},{"$f":"IF(AZ6=\"\",\"\",AZ6-AZ5)","v":""},{"$f":"SUM((AW6,AY6,BA6))","v":0},null,3,{"$f":"Visualization!$S$20","v":0},{"$f":"Visualization!$S$21","v":0},{"$f":"Calculation!$AQ$5","v":""},{"$f":"Calculation!$AQ$6","v":""},{"$f":"Calculation!$AQ$7","v":""},{"$f":"Calculation!$AQ$8","v":""},{"$f":"Calculation!$AQ$9","v":""},{"$f":"Calculation!$AQ$10","v":""},{"$f":"Calculation!$AQ$11","v":""},{"$f":"Calculation!$AQ$12","v":""},{"$f":"Calculation!$AQ$13","v":""},{"$f":"Calculation!$AQ$14","v":""}]
[null,"",3,{"$f":"IF(Values!C7=\"\",\"\",Values!C7)","v":""},{"$f":"IF(Values!D7=\"\",\"\",Values!D7)","v":""},{"$f":"IF(Values!E7=\"\",\"\",Values!E7)","v":""},{"$f":"IF(Values!F7=\"\",\"\",Values!F7)","v":""},{"$f":"IF(Values!G7=\"\",\"\",Values!G7)","v":""},{"$f":"IF(Values!H7=\"\",\"\",Values!H7)","v":""},{"$f":"IF(Values!I7=\"\",\"\",Values!I7)","v":""},{"$f":"IF(Values!J7=\"\",\"\",Values!J7)","v":""},{"$f":"IF(Values!K7=\"\",\"\",Values!K7)","v":""},{"$f":"IF(Values!L7=\"\",\"\",Values!L7)","v":""},null,"",3,"","","","","","","","","","",{"$f":"IF(AJ7=1,IF(Q7-Visualization!$S$20>Visualization!$S$21-Q7,\"USL\",\"LSL\"),\"\")","v":""},null,"","","",null,0,0,1,0,null,"",0.5,"",null,3,{"$f":"IF(COUNTIF(AL7:AL56,AP7)=1,VLOOKUP(AP7,$AL$5:$AN$54,3,FALSE),\"\")","v":""},{"$f":"IF(AQ7=\"\",\"\",AQ7-AQ8)","v":""},null,null,"","","","","","",{"$f":"IF(AZ7=\"\",\"\",AZ7-AZ6)","v":""},{"$f":"SUM((AW7,AY7,BA7))","v":0},null,4,{"$f":"Visualization!$S$20","v":0},{"$f":"Visualization!$S$21","v":0},{"$f":"Calculation!$AQ$5","v":""},{"$f":"Calculation!$AQ$6","v":""},{"$f":"Calculation!$AQ$7","v":""},{"$f":"Calculation!$AQ$8","v":""},{"$f":"Calculation!$AQ$9","v":""},{"$f":"Calculation!$AQ$10","v":""},{"$f":"Calculation!$AQ$11","v":""},{"$f":"Calculation!$AQ$12","v":""},{"$f":"Calculation!$AQ$13","v":""},{"$f":"Calculation!$AQ$14","v":""}]
[null,"",4,{"$f":"IF(Values!C8=\"\",\"\",Values!C8)","v":""},{"$f":"IF(Values!D8=\"\",\"\",Values!D8)","v":""},{"$f":"IF(Values!E8=\"\",\"\",Values!E8)","v":""},{"$f":"IF(Values!F8=\"\",\"\",Values!F8)","v":""},{"$f":"IF(Values!G8=\"\",\"\",Values!G8)","v":""},{"$f":"IF(Values!H8=\"\",\"\",Values!H8)","v":""},{"$f":"IF(Values!I8=\"\",\"\",Values!I8)","v":""},{"$f":"IF(Values!J8=\"\",\"\",Values!J8)","v":""},{"$f":"IF(Values!K8=\"\",\"\",Values!K8)","v":""},{"$f":"IF(Values!L8=\"\",\"\",Values!L8)","v":""},null,"",4,"","","","","","","","","","",{"$f":"IF(AJ8=1,IF(Q8-Visualization!$S$20>Visualization!$S$21-Q8,\"USL\",\"LSL\"),\"\")","v":""},null,"","","",null,0,0,1,0,null,"",0.5,"",null,4,"",null,null,null,"","","","","","","",{"$f":"SUM((AW8,AY8,BA8))","v":0},null,5,{"$f":"Visualization!$S$20","v":0},{"$f":"Visualization!$S$21","v":0},{"$f":"Calculation!$AQ$5","v":""},{"$f":"Calculation!$AQ$6","v":""},{"$f":"Calculation!$AQ$7","v":""},{"$f":"Calculation!$AQ$8","v":""},{"$f":"Calculation!$AQ$9","v":""},{"$f":"Calculation!$AQ$10","v":""},{"$f":"Calculation!$AQ$11","v":""},{"$f":"Calculation!$AQ$12","v":""},{"$f":"Calculation!$AQ$13","v":""},{"$f":"Calculation!$AQ$14","v":""}]
[null,"",5,{"$f":"IF(Values!C9=\"\",\"\",Values!C9)","v":""},{"$f":"IF(Values!D9=\"\",\"\",Values!D9)","v":""},{"$f":"IF(Values!E9=\"\",\"\",Values!E9)","v":""},{"$f":"IF(Values!F9=\"\",\"\",Values!F9)","v":""},{"$f":"IF(Values!G9=\"\",\"\",Values!G9)","v":""},{"$f":"IF(Values!H9=\"\",\"\",Values!H9)","v":""},{"$f":"IF(Values!I9=\"\",\"\",Values!I9)","v":""},{"$f":"IF(Values!J9=\"\",\"\",Values!J9)","v":""},{"$f":"IF(Values!K9=\"\",\"\",Values!K9)","v":""},{"$f":"IF(Values!L9=\"\",\"\",Values!L9)","v":""},null,"",5,"","","","","","","","","","",{"$f":"IF(AJ9=1,IF(Q9-Visualization!$S$20>Visualization!$S$21-Q9,\"USL\",\"LSL\"),\"\")","v":""},null,"","","",null,0,0,1,0,null,"",0.5,"",null,5,"",{"$f":"IF(AQ9=\"\",\"\",AQ9-AQ10)","v":""},null,null,"","","","","","","",{"$f":"SUM((AW9,AY9,BA9))","v":0},null,6,{"$f":"Visualization!$S$20","v":0},{"$f":"Visualization!$S$21","v":0},{"$f":"Calculation!$AQ$5","v":""},{"$f":"Calculation!$AQ$6","v":""},{"$f":"Calculation!$AQ$7","v":""},{"$f":"Calculation!$AQ$8","v":""},{"$f":"Calculation!$AQ$9","v":""},{"$f":"Calculation!$AQ$10","v":""},{"$f":"Calculation!$AQ$11","v":""},{"$f":"Calculation!$AQ$12","v":""},{"$f":"Calculation!$AQ$13","v":""},{"$f":"Calculation!$AQ$14","v":""}]
[null,"",6,{"$f":"IF(Values!C10=\"\",\"\",Values!C10)","v":""},{"$f":"IF(Values!D10=\"\",\"\",Values!D10)","v":""},{"$f":"IF(Values!E10=\"\",\"\",Values!E10)","v":""},{"$f":"IF(Values!F10=\"\",\"\",Values!F10)","v":""},{"$f":"IF(Values!G10=\"\",\"\",Values!G10)","v":""},{"$f":"IF(Values!H10=\"\",\"\",Values!H10)","v":""},{"$f":"IF(Values!I10=\"\",\"\",Values!I10)","v":""},{"$f":"IF(Values!J10=\"\",\"\",Values!J10)","v":""},{"$f":"IF(Values!K10=\"\",\"\",Values!K10)","v":""},{"$f":"IF(Values!L10=\"\",\"\",Values!L10)","v":""},null,"",6,"","","","","","","","","","",{"$f":"IF(AJ10=1,IF(Q10-Visualization!$S$20>Visualization!$S$21-Q10,\"USL\",\"LSL\"),\"\")","v":""},null,"","","",null,0,0,1,0,null,"",0.5,"",null,6,"",null,null,null,"","","","","","","",{"$f":"SUM((AW10,AY10,BA10))","v":0},null,7,{"$f":"Visualization!$S$20","v":0},{"$f":"Visualization!$S$21","v":0},{"$f":"Calculation!$AQ$5","v":""},{"$f":"Calculation!$AQ$6","v":""},{"$f":"Calculation!$AQ$7","v":""},{"$f":"Calculation!$AQ$8","v":""},{"$f":"Calculation!$AQ$9","v":""},{"$f":"Calculation!$AQ$10","v":""},{"$f":"Calculation!$AQ$11","v":""},{"$f":"Calculation!$AQ$12","v":""},{"$f":"Calculation!$AQ$13","v":""},{"$f":"Calculation!$AQ$14","v":""}]
[null,"",7,{"$f":"IF(Values!C11=\"\",\"\",Values!C11)","v":""},{"$f":"IF(Values!D11=\"\",\"\",Values!D11)","v":""},{"$f":"IF(Values!E11=\"\",\"\",Values!E11)","v":""},{"$f":"IF(Values!F11=\"\",\"\",Values!F11)","v":""},{"$f":"IF(Values!G11=\"\",\"\",Values!G11)","v":""},{"$f":"IF(Values!H11=\"\",\"\",Values!H11)","v":""},{"$f":"IF(Values!I11=\"\",\"\",Values!I11)","v":""},{"$f":"IF(Values!J11=\"\",\"\",Values!J11)","v":""},{"$f":"IF(Values!K11=\"\",\"\",Values!K11)","v":""},{"$f":"IF(Values!L11=\"\",\"\",Values!L11)","v":""},null,"",7,"","","","","","","","","","",{"$f":"IF(AJ11=1,IF(Q11-Visualization!$S$20>Visualization!$S$21-Q11,\"USL\",\"LSL\"),\"\")","v":""},null,"","","",null,0,0,1,0,null,"",0.5,"",null,7,"",{"$f":"IF(AQ11=\"\",\"\",AQ11-AQ12)","v":""},null,null,"","","","","","","",{"$f":"SUM((AW11,AY11,BA11))","v":0},null,8,{"$f":"Visualization!$S$20","v":0},{"$f":"Visualization!$S$21","v":0},{"$f":"Calculation!$AQ$5","v":""},{"$f":"Calculation!$AQ$6","v":""},{"$f":"Calculation!$AQ$7","v":""},{"$f":"Calculation!$AQ$8","v":""},{"$f":"Calculation!$AQ$9","v":""},{"$f":"Calculation!$AQ$10","v":""},{"$f":"Calculation!$AQ$11","v":""},{"$f":"Calculation!$AQ$12","v":""},{"$f":"Calculation!$AQ$13","v":""},{"$f":"Calculation!$AQ$14","v":""}]
[null,"",8,{"$f":"IF(Values!C12=\"\",\"\",Values!C12)","v":""},{"$f":"IF(Values!D12=\"\",\"\",Values!D12)","v":""},{"$f":"IF(Values!E12=\"\",\"\",Values!E12)","v":""},{"$f":"IF(Values!F12=\"\",\"\",Values!F12)","v":""},{"$f":"IF(Values!G12=\"\",\"\",Values!G12)","v":""},{"$f":"IF(Values!H12=\"\",\"\",Values!H12)","v":""},{"$f":"IF(Values!I12=\"\",\"\",Values!I12)","v":""},{"$f":"IF(Values!J12=\"\",\"\",Values!J12)","v":""},{"$f":"IF(Values!K12=\"\",\"\",Values!K12)","v":""},{"$f":"IF(Values!L12=\"\",\"\",Values!L12)","v":""},null,"",8,"","","","","","","","","","",{"$f":"IF(AJ12=1,IF(Q12-Visualization!$S$20>Visualization!$S$21-Q12,\"USL\",\"LSL\"),\"\")","v":""},null,"","","",null,0,0,1,0,null,"",0.5,"",null,8,"",null,null,null,"","","","","","","",{"$f":"SUM((AW12,AY12,BA12))","v":0},null,9,{"$f":"Visualization!$S$20","v":0},{"$f":"Visualization!$S$21","v":0},{"$f":"Calculation!$AQ$5","v":""},{"$f":"Calculation!$AQ$6","v":""},{"$f":"Calculation!$AQ$7","v":""},{"$f":"Calculation!$AQ$8","v":""},{"$f":"Calculation!$AQ$9","v":""},{"$f":"Calculation!$AQ$10","v":""},{"$f":"Calculation!$AQ$11","v":""},{"$f":"Calculation!$AQ$12","v":""},{"$f":"Calculation!$AQ$13","v":""},{"$f":"Calculation!$AQ$14","v":""}]
[null,"",9,{"$f":"IF(Values!C13=\"\",\"\",Values!C13)","v":""},{"$f":"IF(Values!D13=\"\",\"\",Values!D13)","v":""},{"$f":"IF(Values!E13=\"\",\"\",Values!E13)","v":""},{"$f":"IF(Values!F13=\"\",\"\",Values!F13)","v":""},{"$f":"IF(Values!G13=\"\",\"\",Values!G13)","v":""},{"$f":"IF(Values!H13=\"\",\"\",Values!H13)","v":""},{"$f":"IF(Values!I13=\"\",\"\",Values!I13)","v":""},{"$f":"IF(Values!J13=\"\",\"\",Values!J13)","v":""},{"$f":"IF(Values!K13=\"\",\"\",Values!K13)","v":""},{"$f":"IF(Values!L13=\"\",\"\",Values!L13)","v":""},null,"",9,"","","","","","","","","","",{"$f":"IF(AJ13=1,IF(Q13-Visualization!$S$20>Visualization!$S$21-Q13,\"USL\",\"LSL\"),\"\")","v":""},null,"","","",null,0,0,1,0,null,"",0.5,"",null,9,"",{"$f":"IF(AQ13=\"\",\"\",AQ13-AQ14)","v":""},null,null,"","","","","","","",{"$f":"SUM((AW13,AY13,BA13))","v":0},null,10,{"$f":"Visualization!$S$20","v":0},{"$f":"Visualization!$S$21","v":0},{"$f":"Calculation!$AQ$5","v":""},{"$f":"Calculation!$AQ$6","v":""},{"$f":"Calculation!$AQ$7","v":""},{"$f":"Calculation!$AQ$8","v":""},{"$f":"Calculation!$AQ$9","v":""},{"$f":"Calculation!$AQ$10","v":""},{"$f":"Calculation!$AQ$11","v":""},{"$f":"Calculation!$AQ$12","v":""},{"$f":"Calculation!$AQ$13","v":""},{"$f":"Calculation!$AQ$14","v":""}]
[null,"",10,{"$f":"IF(Values!C14=\"\",\"\",Values!C14)","v":""},{"$f":"IF(Values!D14=\"\",\"\",Values!D14)","v":""},{"$f":"IF(Values!E14=\"\",\"\",Values!E14)","v":""},{"$f":"IF(Values!F14=\"\",\"\",Values!F14)","v":""},{"$f":"IF(Values!G14=\"\",\"\",Values!G14)","v":""},{"$f":"IF(Values!H14=\"\",\"\",Values!H14)","v":""},{"$f":"IF(Values!I14=\"\",\"\",Values!I14)","v":""},{"$f":"IF(Values!J14=\"\",\"\",Values!J14)","v":""},{"$f":"IF(Values!K14=\"\",\"\",Values!K14)","v":""},{"$f":"IF(Values!L14=\"\",\"\",Values!L14)","v":""},null,"",10,"","","","","","","","","","",{"$f":"IF(AJ14=1,IF(Q14-Visualization!$S$20>Visualization!$S$21-Q14,\"USL\",\"LSL\"),\"\")","v":""},null,"","","",null,0,0,1,0,null,"",0.5,"",null,10,"",null,null,null,"","","","","","","",{"$f":"SUM((AW14,AY14,BA14))","v":0},null,11,{"$f":"Visualization!$S$20","v":0},{"$f":"Visualization!$S$21","v":0},{"$f":"Calculation!$AQ$5","v":""},{"$f":"Calculation!$AQ$6","v":""},{"$f":"Calculation!$AQ$7","v":""},{"$f":"Calculation!$AQ$8","v":""},{"$f":"Calculation!$AQ$9","v":""},{"$f":"Calculation!$AQ$10","v":""},{"$f":"Calculation!$AQ$11","v":""},{"$f":"Calculation!$AQ$12","v":""},{"$f":"Calculation!$AQ$13","v":""},{"$f":"Calculation!$AQ$14","v":""}]
[null,"",11,{"$f":"IF(Values!C15=\"\",\"\",Values!C15)","v":""},{"$f":"IF(Values!D15=\"\",\"\",Values!D15)","v":""},{"$f":"IF(Values!E15=\"\",\"\",Values!E15)","v":""},{"$f":"IF(Values!F15=\"\",\"\",Values!F15)","v":""},{"$f":"IF(Values!G15=\"\",\"\",Values!G15)","v":""},{"$f":"IF(Values!H15=\"\",\"\",Values!H15)","v":""},{"$f":"IF(Values!I15=\"\",\"\",Values!I15)","v":""},{"$f":"IF(Values!J15=\"\",\"\",Values!J15)","v":""},{"$f":"IF(Values!K15=\"\",\"\",Values!K15)","v":""},{"$f":"IF(Values!L15=\"\",\"\",Values!L15)","v":""},null,"",11,"","","","","","","","","","",{"$f":"IF(AJ15=1,IF(Q15-Visualization!$S$20>Visualization!$S$21-Q15,\"USL\",\"LSL\"),\"\")","v":""},null,"","","",null,0,0,1,0,null,"",0.5,"",null,null,"∑",{"$f":"IF(OR(AR9<>\"\",AR11<>\"\",AR13<>\"\",AR5=\"\"),\"\",SUM(AR5:AR14))","v":""},null,null,"","","","","","","",{"$f":"SUM((AW15,AY15,BA15))","v":0},null,12,{"$f":"Visualization!$S$20","v":0},{"$f":"Visualization!$S$21","v":0},{"$f":"Calculation!$AQ$5","v":""},{"$f":"Calculation!$AQ$6","v":""},{"$f":"Calculation!$AQ$7","v":""},{"$f":"Calculation!$AQ$8","v":""},{"$f":"Calculation!$AQ$9","v":""},{"$f":"Calculation!$AQ$10","v":""},{"$f":"Calculation!$AQ$11","v":""},{"$f":"Calculation!$AQ$12","v":""},{"$f":"Calculation!$AQ$13","v":""},{"$f":"Calculation!$AQ$14","v":""}]
[null,"",12,{"$f":"IF(Values!C16=\"\",\"\",Values!C16)","v":""},{"$f":"IF(Values!D16=\"\",\"\",Values!D16)","v":""},{"$f":"IF(Values!E16=\"\",\"\",Values!E16)","v":""},{"$f":"IF(Values!F16=\"\",\"\",Values!F16)","v":""},{"$f":"IF(Values!G16=\"\",\"\",Values!G16)","v":""},{"$f":"IF(Values!H16=\"\",\"\",Values!H16)","v":""},{"$f":"IF(Values!I16=\"\",\"\",Values!I16)","v":""},{"$f":"IF(Values!J16=\"\",\"\",Values!J16)","v":""},{"$f":"IF(Values!K16=\"\",\"\",Values!K16)","v":""},{"$f":"IF(Values!L16=\"\",\"\",Values!L16)","v":""},null,"",12,"","","","","","","","","","",{"$f":"IF(AJ16=1,IF(Q16-Visualization!$S$20>Visualization!$S$21-Q16,\"USL\",\"LSL\"),\"\")","v":""},null,"","","",null,0,0,1,0,null,"",0.5,"",null,null,null,null,null,null,"","","","","","","",{"$f":"SUM((AW16,AY16,BA16))","v":0},null,13,{"$f":"Visualization!$S$20","v":0},{"$f":"Visualization!$S$21","v":0},{"$f":"Calculation!$AQ$5","v":""},{"$f":"Calculation!$AQ$6","v":""},{"$f":"Calculation!$AQ$7","v":""},{"$f":"Calculation!$AQ$8","v":""},{"$f":"Calculation!$AQ$9","v":""},{"$f":"Calculation!$AQ$10","v":""},{"$f":"Calculation!$AQ$11","v":""},{"$f":"Calculation!$AQ$12","v":""},{"$f":"Calculation!$AQ$13","v":""},{"$f":"Calculation!$AQ$14","v":""}]
[null,"",13,{"$f":"IF(Values!C17=\"\",\"\",Values!C17)","v":""},{"$f":"IF(Values!D17=\"\",\"\",Values!D17)","v":""},{"$f":"IF(Values!E17=\"\",\"\",Values!E17)","v":""},{"$f":"IF(Values!F17=\"\",\"\",Values!F17)","v":""},{"$f":"IF(Values!G17=\"\",\"\",Values!G17)","v":""},{"$f":"IF(Values!H17=\"\",\"\",Values!H17)","v":""},{"$f":"IF(Values!I17=\"\",\"\",Values!I17)","v":""},{"$f":"IF(Values!J17=\"\",\"\",Values!J17)","v":""},{"$f":"IF(Values!K17=\"\",\"\",Values!K17)","v":""},{"$f":"IF(Values!L17=\"\",\"\",Values!L17)","v":""},null,"",13,"","","","","","","","","","",{"$f":"IF(AJ17=1,IF(Q17-Visualization!$S$20>Visualization!$S$21-Q17,\"USL\",\"LSL\"),\"\")","v":""},null,"","","",null,0,0,1,0,null,{"$f":"IF(AN17=\"\",\"\",RANK(AN17,$AN$5:$AN$54))","v":""},0.5,"",null,null,"d",{"$f":"IF(AR15=\"\",\"\",AR15/2)","v":""},null,null,null,null,null,null,null,null,"Max",{"$f":"MAX(BB5:BB16)","v":0},null,14,{"$f":"Visualization!$S$20","v":0},{"$f":"Visualization!$S$21","v":0},{"$f":"Calculation!$AQ$5","v":""},{"$f":"Calculation!$AQ$6","v":""},{"$f":"Calculation!$AQ$7","v":""},{"$f":"Calculation!$AQ$8","v":""},{"$f":"Calculation!$AQ$9","v":""},{"$f":"Calculation!$AQ$10","v":""},{"$f":"Calculation!$AQ$11","v":""},{"$f":"Calculation!$AQ$12","v":""},{"$f":"Calculation!$AQ$13","v":""},{"$f":"Calculation!$AQ$14","v":""}]
[null,"",14,{"$f":"IF(Values!C18=\"\",\"\",Values!C18)","v":""},{"$f":"IF(Values!D18=\"\",\"\",Values!D18)","v":""},{"$f":"IF(Values!E18=\"\",\"\",Values!E18)","v":""},{"$f":"IF(Values!F18=\"\",\"\",Values!F18)","v":""},{"$f":"IF(Values!G18=\"\",\"\",Values!G18)","v":""},{"$f":"IF(Values!H18=\"\",\"\",Values!H18)","v":""},{"$f":"IF(Values!I18=\"\",\"\",Values!I18)","v":""},{"$f":"IF(Values!J18=\"\",\"\",Values!J18)","v":""},{"$f":"IF(Values!K18=\"\",\"\",Values!K18)","v":""},{"$f":"IF(Values!L18=\"\",\"\",Values!L18)","v":""},null,"",14,"","","","","","","","","","",{"$f":"IF(AJ18=1,IF(Q18-Visualization!$S$20>Visualization!$S$21-Q18,\"USL\",\"LSL\"),\"\")","v":""},null,"","","",null,0,0,1,0,null,"",0.5,"",null,null,null,null,null,null,null,null,null,null,null,null,null,null,null,15,{"$f":"Visualization!$S$20","v":0},{"$f":"Visualization!$S$21","v":0},{"$f":"Calculation!$AQ$5","v":""},{"$f":"Calculation!$AQ$6","v":""},{"$f":"Calculation!$AQ$7","v":""},{"$f":"Calculation!$AQ$8","v":""},{"$f":"Calculation!$AQ$9","v":""},{"$f":"Calculation!$AQ$10","v":""},{"$f":"Calculation!$AQ$11","v":""},{"$f":"Calculation!$AQ$12","v":""},{"$f":"Calculation!$AQ$13","v":""},{"$f":"Calculation!$AQ$14","v":""}]
[null,"",15,{"$f":"IF(Values!C19=\"\",\"\",Values!C19)","v":""},{"$f":"IF(Values!D19=\"\",\"\",Values!D19)","v":""},{"$f":"IF(Values!E19=\"\",\"\",Values!E19)","v":""},{"$f":"IF(Values!F19=\"\",\"\",Values!F19)","v":""},{"$f":"IF(Values!G19=\"\",\"\",Values!G19)","v":""},{"$f":"IF(Values!H19=\"\",\"\",Values!H19)","v":""},{"$f":"IF(Values!I19=\"\",\"\",Values!I19)","v":""},{"$f":"IF(Values!J19=\"\",\"\",Values!J19)","v":""},{"$f":"IF(Values!K19=\"\",\"\",Values!K19)","v":""},{"$f":"IF(Values!L19=\"\",\"\",Values!L19)","v":""},null,"",15,"","","","","","","","","","",{"$f":"IF(AJ19=1,IF(Q19-Visualization!$S$20>Visualization!$S$21-Q19,\"USL\",\"LSL\"),\"\")","v":""},null,"","","",null,0,0,1,0,null,"",0.5,"",null,null,"UAttr",{"$f":"IF(AR17=\"\",\"\",AR17/2)","v":""},null,null,null,null,null,null,null,null,null,null,null,16,{"$f":"Visualization!$S$20","v":0},{"$f":"Visualization!$S$21","v":0},{"$f":"Calculation!$AQ$5","v":""},{"$f":"Calculation!$AQ$6","v":""},{"$f":"Calculation!$AQ$7","v":""},{"$f":"Calculation!$AQ$8","v":""},{"$f":"Calculation!$AQ$9","v":""},{"$f":"Calculation!$AQ$10","v":""},{"$f":"Calculation!$AQ$11","v":""},{"$f":"Calculation!$AQ$12","v":""},{"$f":"Calculation!$AQ$13","v":""},{"$f":"Calculation!$AQ$14","v":""}]
[null,"",16,{"$f":"IF(Values!C20=\"\",\"\",Values!C20)","v":""},{"$f":"IF(Values!D20=\"\",\"\",Values!D20)","v":""},{"$f":"IF(Values!E20=\"\",\"\",Values!E20)","v":""},{"$f":"IF(Values!F20=\"\",\"\",Values!F20)","v":""},{"$f":"IF(Values!G20=\"\",\"\",Values!G20)","v":""},{"$f":"IF(Values!H20=\"\",\"\",Values!H20)","v":""},{"$f":"IF(Values!I20=\"\",\"\",Values!I20)","v":""},{"$f":"IF(Values!J20=\"\",\"\",Values!J20)","v":""},{"$f":"IF(Values!K20=\"\",\"\",Values!K20)","v":""},{"$f":"IF(Values!L20=\"\",\"\",Values!L20)","v":""},null,"",16,"","","","","","","","","","",{"$f":"IF(AJ20=1,IF(Q20-Visualization!$S$20>Visualization!$S$21-Q20,\"USL\",\"LSL\"),\"\")","v":""},null,"","","",null,0,0,1,0,null,"",0.5,"",null,null,null,null,null,null,null,null,null,null,null,null,null,null,null,17,{"$f":"Visualization!$S$20","v":0},{"$f":"Visualization!$S$21","v":0},{"$f":"Calculation!$AQ$5","v":""},{"$f":"Calculation!$AQ$6","v":""},{"$f":"Calculation!$AQ$7","v":""},{"$f":"Calculation!$AQ$8","v":""},{"$f":"Calculation!$AQ$9","v":""},{"$f":"Calculation!$AQ$10","v":""},{"$f":"Calculation!$AQ$11","v":""},{"$f":"Calculation!$AQ$12","v":""},{"$f":"Calculation!$AQ$13","v":""},{"$f":"Calculation!$AQ$14","v":""}]
[null,"",17,{"$f":"IF(Values!C21=\"\",\"\",Values!C21)","v":""},{"$f":"IF(Values!D21=\"\",\"\",Values!D21)","v":""},{"$f":"IF(Values!E21=\"\",\"\",Values!E21)","v":""},{"$f":"IF(Values!F21=\"\",\"\",Values!F21)","v":""},{"$f":"IF(Values!G21=\"\",\"\",Values!G21)","v":""},{"$f":"IF(Values!H21=\"\",\"\",Values!H21)","v":""},{"$f":"IF(Values!I21=\"\",\"\",Values!I21)","v":""},{"$f":"IF(Values!J21=\"\",\"\",Values!J21)","v":""},{"$f":"IF(Values!K21=\"\",\"\",Values!K21)","v":""},{"$f":"IF(Values!L21=\"\",\"\",Values!L21)","v":""},null,"",17,"","","","","","","","","","",{"$f":"IF(AJ21=1,IF(Q21-Visualization!$S$20>Visualization!$S$21-Q21,\"USL\",\"LSL\"),\"\")","v":""},null,"","","",null,0,0,1,0,null,"",0.5,"",null,null,"%GAttr",{"$f":"IF(AR19=\"\",\"\",ROUND(2*AR19/(Visualization!S20-Visualization!S21)*100,2))","v":""},null,null,null,null,null,null,null,null,null,null,null,18,{"$f":"Visualization!$S$20","v":0},{"$f":"Visualization!$S$21","v":0},{"$f":"Calculation!$AQ$5","v":""},{"$f":"Calculation!$AQ$6","v":""},{"$f":"Calculation!$AQ$7","v":""},{"$f":"Calculation!$AQ$8","v":""},{"$f":"Calculation!$AQ$9","v":""},{"$f":"Calculation!$AQ$10","v":""},{"$f":"Calculation!$AQ$11","v":""},{"$f":"Calculation!$AQ$12","v":""},{"$f":"Calculation!$AQ$13","v":""},{"$f":"Calculation!$AQ$14","v":""}]
[null,"",18,{"$f":"IF(Values!C22=\"\",\"\",Values!C22)","v":""},{"$f":"IF(Values!D22=\"\",\"\",Values!D22)","v":""},{"$f":"IF(Values!E22=\"\",\"\",Values!E22)","v":""},{"$f":"IF(Values!F22=\"\",\"\",Values!F22)","v":""},{"$f":"IF(Values!G22=\"\",\"\",Values!G22)","v":""},{"$f":"IF(Values!H22=\"\",\"\",Values!H22)","v":""},{"$f":"IF(Values!I22=\"\",\"\",Values!I22)","v":""},{"$f":"IF(Values!J22=\"\",\"\",Values!J22)","v":""},{"$f":"IF(Values!K22=\"\",\"\",Values!K22)","v":""},{"$f":"IF(Values!L22=\"\",\"\",Values!L22)","v":""},null,"",18,"","","","","","","","","","",{"$f":"IF(AJ22=1,IF(Q22-Visualization!$S$20>Visualization!$S$21-Q22,\"USL\",\"LSL\"),\"\")","v":""},null,"","","",null,0,0,1,0,null,"",0.5,"",null,null,null,null,null,null,"Capability",null,null,null,null,null,null,null,null,19,{"$f":"Visualization!$S$20","v":0},{"$f":"Visualization!$S$21","v":0},{"$f":"Calculation!$AQ$5","v":""},{"$f":"Calculation!$AQ$6","v":""},{"$f":"Calculation!$AQ$7","v":""},{"$f":"Calculation!$AQ$8","v":""},{"$f":"Calculation!$AQ$9","v":""},{"$f":"Calculation!$AQ$10","v":""},{"$f":"Calculation!$AQ$11","v":""},{"$f":"Calculation!$AQ$12","v":""},{"$f":"Calculation!$AQ$13","v":""},{"$f":"Calculation!$AQ$14","v":""}]
[null,"",19,{"$f":"IF(Values!C23=\"\",\"\",Values!C23)","v":""},{"$f":"IF(Values!D23=\"\",\"\",Values!D23)","v":""},{"$f":"IF(Values!E23=\"\",\"\",Values!E23)","v":""},{"$f":"IF(Values!F23=\"\",\"\",Values!F23)","v":""},{"$f":"IF(Values!G23=\"\",\"\",Values!G23)","v":""},{"$f":"IF(Values!H23=\"\",\"\",Values!H23)","v":""},{"$f":"IF(Values!I23=\"\",\"\",Values!I23)","v":""},{"$f":"IF(Values!J23=\"\",\"\",Values!J23)","v":""},{"$f":"IF(Values!K23=\"\",\"\",Values!K23)","v":""},{"$f":"IF(Values!L23=\"\",\"\",Values!L23)","v":""},null,"",19,"","","","","","","","","","",{"$f":"IF(AJ23=1,IF(Q23-Visualization!$S$20>Visualization!$S$21-Q23,\"USL\",\"LSL\"),\"\")","v":""},null,"","","",null,0,0,1,0,null,"",0.5,"",null,null,null,null,null,null,{"$f":"IF(AR21=\"\",\"\",IF(AND(AR21<20,COUNT(AR5:AR14)<3),\"Approved\",\"NG\"))","v":""},null,null,null,null,null,null,null,null,20,{"$f":"Visualization!$S$20","v":0},{"$f":"Visualization!$S$21","v":0},{"$f":"Calculation!$AQ$5","v":""},{"$f":"Calculation!$AQ$6","v":""},{"$f":"Calculation!$AQ$7","v":""},{"$f":"Calculation!$AQ$8","v":""},{"$f":"Calculation!$AQ$9","v":""},{"$f":"Calculation!$AQ$10","v":""},{"$f":"Calculation!$AQ$11","v":""},{"$f":"Calculation!$AQ$12","v":""},{"$f":"Calculation!$AQ$13","v":""},{"$f":"Calculation!$AQ$14","v":""}]
[null,"",20,{"$f":"IF(Values!C24=\"\",\"\",Values!C24)","v":""},{"$f":"IF(Values!D24=\"\",\"\",Values!D24)","v":""},{"$f":"IF(Values!E24=\"\",\"\",Values!E24)","v":""},{"$f":"IF(Values!F24=\"\",\"\",Values!F24)","v":""},{"$f":"IF(Values!G24=\"\",\"\",Values!G24)","v":""},{"$f":"IF(Values!H24=\"\",\"\",Values!H24)","v":""},{"$f":"IF(Values!I24=\"\",\"\",Values!I24)","v":""},{"$f":"IF(Values!J24=\"\",\"\",Values!J24)","v":""},{"$f":"IF(Values!K24=\"\",\"\",Values!K24)","v":""},{"$f":"IF(Values!L24=\"\",\"\",Values!L24)","v":""},null,"",20,"","","","","","","","","","",{"$f":"IF(AJ24=1,IF(Q24-Visualization!$S$20>Visualization!$S$21-Q24,\"USL\",\"LSL\"),\"\")","v":""},null,"","","",null,0,0,1,0,null,"",0.5,"",null,null,null,null,null,null,null,null,null,null,null,null,null,null,null,21,{"$f":"Visualization!$S$20","v":0},{"$f":"Visualization!$S$21","v":0},{"$f":"Calculation!$AQ$5","v":""},{"$f":"Calculation!$AQ$6","v":""},{"$f":"Calculation!$AQ$7","v":""},{"$f":"Calculation!$AQ$8","v":""},{"$f":"Calculation!$AQ$9","v":""},{"$f":"Calculation!$AQ$10","v":""},{"$f":"Calculation!$AQ$11","v":""},{"$f":"Calculation!$AQ$12","v":""},{"$f":"Calculation!$AQ$13","v":""},{"$f":"Calculation!$AQ$14","v":""}]
[null,"",21,{"$f":"IF(Values!C25=\"\",\"\",Values!C25)","v":""},{"$f":"IF(Values!D25=\"\",\"\",Values!D25)","v":""},{"$f":"IF(Values!E25=\"\",\"\",Values!E25)","v":""},{"$f":"IF(Values!F25=\"\",\"\",Values!F25)","v":""},{"$f":"IF(Values!G25=\"\",\"\",Values!G25)","v":""},{"$f":"IF(Values!H25=\"\",\"\",Values!H25)","v":""},{"$f":"IF(Values!I25=\"\",\"\",Values!I25)","v":""},{"$f":"IF(Values!J25=\"\",\"\",Values!J25)","v":""},{"$f":"IF(Values!K25=\"\",\"\",Values!K25)","v":""},{"$f":"IF(Values!L25=\"\",\"\",Values!L25)","v":""},null,"",21,"","","","","","","","","","",{"$f":"IF(AJ25=1,IF(Q25-Visualization!$S$20>Visualization!$S$21-Q25,\"USL\",\"LSL\"),\"\")","v":""},null,"","","",null,0,0,1,0,null,"",0.5,"",null,null,"General calculations",null,null,null,null,null,null,null,null,null,null,null,null,22,{"$f":"Visualization!$S$20","v":0},{"$f":"Visualization!$S$21","v":0},{"$f":"Calculation!$AQ$5","v":""},{"$f":"Calculation!$AQ$6","v":""},{"$f":"Calculation!$AQ$7","v":""},{"$f":"Calculation!$AQ$8","v":""},{"$f":"Calculation!$AQ$9","v":""},{"$f":"Calculation!$AQ$10","v":""},{"$f":"Calculation!$AQ$11","v":""},{"$f":"Calculation!$AQ$12","v":""},{"$f":"Calculation!$AQ$13","v":""},{"$f":"Calculation!$AQ$14","v":""}]
[null,"",22,{"$f":"IF(Values!C26=\"\",\"\",Values!C26)","v":""},{"$f":"IF(Values!D26=\"\",\"\",Values!D26)","v":""},{"$f":"IF(Values!E26=\"\",\"\",Values!E26)","v":""},{"$f":"IF(Values!F26=\"\",\"\",Values!F26)","v":""},{"$f":"IF(Values!G26=\"\",\"\",Values!G26)","v":""},{"$f":"IF(Values!H26=\"\",\"\",Values!H26)","v":""},{"$f":"IF(Values!I26=\"\",\"\",Values!I26)","v":""},{"$f":"IF(Values!J26=\"\",\"\",Values!J26)","v":""},{"$f":"IF(Values!K26=\"\",\"\",Values!K26)","v":""},{"$f":"IF(Values!L26=\"\",\"\",Values!L26)","v":""},null,"",22,"","","","","","","","","","",{"$f":"IF(AJ26=1,IF(Q26-Visualization!$S$20>Visualization!$S$21-Q26,\"USL\",\"LSL\"),\"\")","v":""},null,"","","",null,0,0,1,0,null,"",0.5,"",null,null,"Number of value:",{"$f":"IF(COUNT(D5:D54)=0,\"\",COUNT(D5:D54))","v":""},null,null,null,null,null,null,null,null,null,null,null,23,{"$f":"Visualization!$S$20","v":0},{"$f":"Visualization!$S$21","v":0},{"$f":"Calculation!$AQ$5","v":""},{"$f":"Calculation!$AQ$6","v":""},{"$f":"Calculation!$AQ$7","v":""},{"$f":"Calculation!$AQ$8","v":""},{"$f":"Calculation!$AQ$9","v":""},{"$f":"Calculation!$AQ$10","v":""},{"$f":"Calculation!$AQ$11","v":""},{"$f":"Calculation!$AQ$12","v":""},{"$f":"Calculation!$AQ$13","v":""},{"$f":"Calculation!$AQ$14","v":""}]
[null,"",23,{"$f":"IF(Values!C27=\"\",\"\",Values!C27)","v":""},{"$f":"IF(Values!D27=\"\",\"\",Values!D27)","v":""},{"$f":"IF(Values!E27=\"\",\"\",Values!E27)","v":""},{"$f":"IF(Values!F27=\"\",\"\",Values!F27)","v":""},{"$f":"IF(Values!G27=\"\",\"\",Values!G27)","v":""},{"$f":"IF(Values!H27=\"\",\"\",Values!H27)","v":""},{"$f":"IF(Values!I27=\"\",\"\",Values!I27)","v":""},{"$f":"IF(Values!J27=\"\",\"\",Values!J27)","v":""},{"$f":"IF(Values!K27=\"\",\"\",Values!K27)","v":""},{"$f":"IF(Values!L27=\"\",\"\",Values!L27)","v":""},null,"",23,"","","","","","","","","","",{"$f":"IF(AJ27=1,IF(Q27-Visualization!$S$20>Visualization!$S$21-Q27,\"USL\",\"LSL\"),\"\")","v":""},null,"","","",null,0,0,1,0,null,"",0.5,"",null,null,"Max value:",{"$f":"IF(COUNT(D5:D54)=0,\"\",MAX(D5:D54))","v":""},null,null,null,null,null,null,null,null,null,null,null,24,{"$f":"Visualization!$S$20","v":0},{"$f":"Visualization!$S$21","v":0},{"$f":"Calculation!$AQ$5","v":""},{"$f":"Calculation!$AQ$6","v":""},{"$f":"Calculation!$AQ$7","v":""},{"$f":"Calculation!$AQ$8","v":""},{"$f":"Calculation!$AQ$9","v":""},{"$f":"Calculation!$AQ$10","v":""},{"$f":"Calculation!$AQ$11","v":""},{"$f":"Calculation!$AQ$12","v":""},{"$f":"Calculation!$AQ$13","v":""},{"$f":"Calculation!$AQ$14","v":""}]
[null,"",24,{"$f":"IF(Values!C28=\"\",\"\",Values!C28)","v":""},{"$f":"IF(Values!D28=\"\",\"\",Values!D28)","v":""},{"$f":"IF(Values!E28=\"\",\"\",Values!E28)","v":""},{"$f":"IF(Values!F28=\"\",\"\",Values!F28)","v":""},{"$f":"IF(Values!G28=\"\",\"\",Values!G28)","v":""},{"$f":"IF(Values!H28=\"\",\"\",Values!H28)","v":""},{"$f":"IF(Values!I28=\"\",\"\",Values!I28)","v":""},{"$f":"IF(Values!J28=\"\",\"\",Values!J28)","v":""},{"$f":"IF(Values!K28=\"\",\"\",Values!K28)","v":""},{"$f":"IF(Values!L28=\"\",\"\",Values!L28)","v":""},null,"",24,"","","","","","","","","","",{"$f":"IF(AJ28=1,IF(Q28-Visualization!$S$20>Visualization!$S$21-Q28,\"USL\",\"LSL\"),\"\")","v":""},null,"","","",null,0,0,1,0,null,"",0.5,"",null,null,"Min value:",{"$f":"IF(COUNT(D5:D54)=0,\"\",MIN(D5:D54))","v":""},null,null,null,null,null,null,null,null,null,null,null,25,{"$f":"Visualization!$S$20","v":0},{"$f":"Visualization!$S$21","v":0},{"$f":"Calculation!$AQ$5","v":""},{"$f":"Calculation!$AQ$6","v":""},{"$f":"Calculation!$AQ$7","v":""},{"$f":"Calculation!$AQ$8","v":""},{"$f":"Calculation!$AQ$9","v":""},{"$f":"Calculation!$AQ$10","v":""},{"$f":"Calculation!$AQ$11","v":""},{"$f":"Calculation!$AQ$12","v":""},{"$f":"Calculation!$AQ$13","v":""},{"$f":"Calculation!$AQ$14","v":""}]
[null,"",25,{"$f":"IF(Values!C29=\"\",\"\",Values!C29)","v":""},{"$f":"IF(Values!D29=\"\",\"\",Values!D29)","v":""},{"$f":"IF(Values!E29=\"\",\"\",Values!E29)","v":""},{"$f":"IF(Values!F29=\"\",\"\",Values!F29)","v":""},{"$f":"IF(Values!G29=\"\",\"\",Values!G29)","v":""},{"$f":"IF(Values!H29=\"\",\"\",Values!H29)","v":""},{"$f":"IF(Values!I29=\"\",\"\",Values!I29)","v":""},{"$f":"IF(Values!J29=\"\",\"\",Values!J29)","v":""},{"$f":"IF(Values!K29=\"\",\"\",Values!K29)","v":""},{"$f":"IF(Values!L29=\"\",\"\",Values!L29)","v":""},null,"",25,"","","","","","","","","","",{"$f":"IF(AJ29=1,IF(Q29-Visualization!$S$20>Visualization!$S$21-Q29,\"USL\",\"LSL\"),\"\")","v":""},null,"","","",null,0,0,1,0,null,"",0.5,"",null,null,"Span:",{"$f":"IF(AR26=\"\",\"\",AR27-AR28)","v":""},null,null,null,null,null,null,null,null,null,null,null,26,{"$f":"Visualization!$S$20","v":0},{"$f":"Visualization!$S$21","v":0},{"$f":"Calculation!$AQ$5","v":""},{"$f":"Calculation!$AQ$6","v":""},{"$f":"Calculation!$AQ$7","v":""},{"$f":"Calculation!$AQ$8","v":""},{"$f":"Calculation!$AQ$9","v":""},{"$f":"Calculation!$AQ$10","v":""},{"$f":"Calculation!$AQ$11","v":""},{"$f":"Calculation!$AQ$12","v":""},{"$f":"Calculation!$AQ$13","v":""},{"$f":"Calculation!$AQ$14","v":""}]
[null,"",26,{"$f":"IF(Values!C30=\"\",\"\",Values!C30)","v":""},{"$f":"IF(Values!D30=\"\",\"\",Values!D30)","v":""},{"$f":"IF(Values!E30=\"\",\"\",Values!E30)","v":""},{"$f":"IF(Values!F30=\"\",\"\",Values!F30)","v":""},{"$f":"IF(Values!G30=\"\",\"\",Values!G30)","v":""},{"$f":"IF(Values!H30=\"\",\"\",Values!H30)","v":""},{"$f":"IF(Values!I30=\"\",\"\",Values!I30)","v":""},{"$f":"IF(Values!J30=\"\",\"\",Values!J30)","v":""},{"$f":"IF(Values!K30=\"\",\"\",Values!K30)","v":""},{"$f":"IF(Values!L30=\"\",\"\",Values!L30)","v":""},null,"",26,"","","","","","","","","","",{"$f":"IF(AJ30=1,IF(Q30-Visualization!$S$20>Visualization!$S$21-Q30,\"USL\",\"LSL\"),\"\")","v":""},null,"","","",null,0,0,1,0,null,"",0.5,"",null,null,"Number of classes: ",{"$f":"IF(AR26=\"\",\"\",IF(ROUNDUP(AR26^(1/2),0)>20,20,ROUNDUP(AR26^(1/2),0)))","v":""},null,null,null,null,null,null,null,null,null,null,null,27,{"$f":"Visualization!$S$20","v":0},{"$f":"Visualization!$S$21","v":0},{"$f":"Calculation!$AQ$5","v":""},{"$f":"Calculation!$AQ$6","v":""},{"$f":"Calculation!$AQ$7","v":""},{"$f":"Calculation!$AQ$8","v":""},{"$f":"Calculation!$AQ$9","v":""},{"$f":"Calculation!$AQ$10","v":""},{"$f":"Calculation!$AQ$11","v":""},{"$f":"Calculation!$AQ$12","v":""},{"$f":"Calculation!$AQ$13","v":""},{"$f":"Calculation!$AQ$14","v":""}]
[null,"",27,{"$f":"IF(Values!C31=\"\",\"\",Values!C31)","v":""},{"$f":"IF(Values!D31=\"\",\"\",Values!D31)","v":""},{"$f":"IF(Values!E31=\"\",\"\",Values!E31)","v":""},{"$f":"IF(Values!F31=\"\",\"\",Values!F31)","v":""},{"$f":"IF(Values!G31=\"\",\"\",Values!G31)","v":""},{"$f":"IF(Values!H31=\"\",\"\",Values!H31)","v":""},{"$f":"IF(Values!I31=\"\",\"\",Values!I31)","v":""},{"$f":"IF(Values!J31=\"\",\"\",Values!J31)","v":""},{"$f":"IF(Values!K31=\"\",\"\",Values!K31)","v":""},{"$f":"IF(Values!L31=\"\",\"\",Values!L31)","v":""},null,"",27,"","","","","","","","","","",{"$f":"IF(AJ31=1,IF(Q31-Visualization!$S$20>Visualization!$S$21-Q31,\"USL\",\"LSL\"),\"\")","v":""},null,"","","",null,0,0,1,0,null,"",0.5,"",null,null,"Class width:",{"$f":"IF(AR26=\"\",\"\",IF(AR29=0,\"\",AR29/AR30))","v":""},null,null,null,null,null,null,null,null,null,null,null,28,{"$f":"Visualization!$S$20","v":0},{"$f":"Visualization!$S$21","v":0},{"$f":"Calculation!$AQ$5","v":""},{"$f":"Calculation!$AQ$6","v":""},{"$f":"Calculation!$AQ$7","v":""},{"$f":"Calculation!$AQ$8","v":""},{"$f":"Calculation!$AQ$9","v":""},{"$f":"Calculation!$AQ$10","v":""},{"$f":"Calculation!$AQ$11","v":""},{"$f":"Calculation!$AQ$12","v":""},{"$f":"Calculation!$AQ$13","v":""},{"$f":"Calculation!$AQ$14","v":""}]
[null,"",28,{"$f":"IF(Values!C32=\"\",\"\",Values!C32)","v":""},{"$f":"IF(Values!D32=\"\",\"\",Values!D32)","v":""},{"$f":"IF(Values!E32=\"\",\"\",Values!E32)","v":""},{"$f":"IF(Values!F32=\"\",\"\",Values!F32)","v":""},{"$f":"IF(Values!G32=\"\",\"\",Values!G32)","v":""},{"$f":"IF(Values!H32=\"\",\"\",Values!H32)","v":""},{"$f":"IF(Values!I32=\"\",\"\",Values!I32)","v":""},{"$f":"IF(Values!J32=\"\",\"\",Values!J32)","v":""},{"$f":"IF(Values!K32=\"\",\"\",Values!K32)","v":""},{"$f":"IF(Values!L32=\"\",\"\",Values!L32)","v":""},null,"",28,"","","","","","","","","","",{"$f":"IF(AJ32=1,IF(Q32-Visualization!$S$20>Visualization!$S$21-Q32,\"USL\",\"LSL\"),\"\")","v":""},null,"","","",null,0,0,1,0,null,"",0.5,"",null,null,null,null,null,null,null,null,null,null,null,null,null,null,null,29,{"$f":"Visualization!$S$20","v":0},{"$f":"Visualization!$S$21","v":0},{"$f":"Calculation!$AQ$5","v":""},{"$f":"Calculation!$AQ$6","v":""},{"$f":"Calculation!$AQ$7","v":""},{"$f":"Calculation!$AQ$8","v":""},{"$f":"Calculation!$AQ$9","v":""},{"$f":"Calculation!$AQ$10","v":""},{"$f":"Calculation!$AQ$11","v":""},{"$f":"Calculation!$AQ$12","v":""},{"$f":"Calculation!$AQ$13","v":""},{"$f":"Calculation!$AQ$14","v":""}]
[null,"",29,{"$f":"IF(Values!C33=\"\",\"\",Values!C33)","v":""},{"$f":"IF(Values!D33=\"\",\"\",Values!D33)","v":""},{"$f":"IF(Values!E33=\"\",\"\",Values!E33)","v":""},{"$f":"IF(Values!F33=\"\",\"\",Values!F33)","v":""},{"$f":"IF(Values!G33=\"\",\"\",Values!G33)","v":""},{"$f":"IF(Values!H33=\"\",\"\",Values!H33)","v":""},{"$f":"IF(Values!I33=\"\",\"\",Values!I33)","v":""},{"$f":"IF(Values!J33=\"\",\"\",Values!J33)","v":""},{"$f":"IF(Values!K33=\"\",\"\",Values!K33)","v":""},{"$f":"IF(Values!L33=\"\",\"\",Values!L33)","v":""},null,"",29,"","","","","","","","","","",{"$f":"IF(AJ33=1,IF(Q33-Visualization!$S$20>Visualization!$S$21-Q33,\"USL\",\"LSL\"),\"\")","v":""},null,"","","",null,0,0,1,0,null,"",0.5,"",null,null,null,null,null,null,null,null,null,null,null,null,null,null,null,30,{"$f":"Visualization!$S$20","v":0},{"$f":"Visualization!$S$21","v":0},{"$f":"Calculation!$AQ$5","v":""},{"$f":"Calculation!$AQ$6","v":""},{"$f":"Calculation!$AQ$7","v":""},{"$f":"Calculation!$AQ$8","v":""},{"$f":"Calculation!$AQ$9","v":""},{"$f":"Calculation!$AQ$10","v":""},{"$f":"Calculation!$AQ$11","v":""},{"$f":"Calculation!$AQ$12","v":""},{"$f":"Calculation!$AQ$13","v":""},{"$f":"Calculation!$AQ$14","v":""}]
[null,"",30,{"$f":"IF(Values!C34=\"\",\"\",Values!C34)","v":""},{"$f":"IF(Values!D34=\"\",\"\",Values!D34)","v":""},{"$f":"IF(Values!E34=\"\",\"\",Values!E34)","v":""},{"$f":"IF(Values!F34=\"\",\"\",Values!F34)","v":""},{"$f":"IF(Values!G34=\"\",\"\",Values!G34)","v":""},{"$f":"IF(Values!H34=\"\",\"\",Values!H34)","v":""},{"$f":"IF(Values!I34=\"\",\"\",Values!I34)","v":""},{"$f":"IF(Values!J34=\"\",\"\",Values!J34)","v":""},{"$f":"IF(Values!K34=\"\",\"\",Values!K34)","v":""},{"$f":"IF(Values!L34=\"\",\"\",Values!L34)","v":""},null,"",30,"","","","","","","","","","",{"$f":"IF(AJ34=1,IF(Q34-Visualization!$S$20>Visualization!$S$21-Q34,\"USL\",\"LSL\"),\"\")","v":""},null,"","","",null,0,0,1,0,null,"",0.5,"",null,null,null,null,null,null,null,null,null,null,null,null,null,null,null,31,{"$f":"Visualization!$S$20","v":0},{"$f":"Visualization!$S$21","v":0},{"$f":"Calculation!$AQ$5","v":""},{"$f":"Calculation!$AQ$6","v":""},{"$f":"Calculation!$AQ$7","v":""},{"$f":"Calculation!$AQ$8","v":""},{"$f":"Calculation!$AQ$9","v":""},{"$f":"Calculation!$AQ$10","v":""},{"$f":"Calculation!$AQ$11","v":""},{"$f":"Calculation!$AQ$12","v":""},{"$f":"Calculation!$AQ$13","v":""},{"$f":"Calculation!$AQ$14","v":""}]
[null,"",31,{"$f":"IF(Values!C35=\"\",\"\",Values!C35)","v":""},{"$f":"IF(Values!D35=\"\",\"\",Values!D35)","v":""},{"$f":"IF(Values!E35=\"\",\"\",Values!E35)","v":""},{"$f":"IF(Values!F35=\"\",\"\",Values!F35)","v":""},{"$f":"IF(Values!G35=\"\",\"\",Values!G35)","v":""},{"$f":"IF(Values!H35=\"\",\"\",Values!H35)","v":""},{"$f":"IF(Values!I35=\"\",\"\",Values!I35)","v":""},{"$f":"IF(Values!J35=\"\",\"\",Values!J35)","v":""},{"$f":"IF(Values!K35=\"\",\"\",Values!K35)","v":""},{"$f":"IF(Values!L35=\"\",\"\",Values!L35)","v":""},null,"",31,"","","","","","","","","","",{"$f":"IF(AJ35=1,IF(Q35-Visualization!$S$20>Visualization!$S$21-Q35,\"USL\",\"LSL\"),\"\")","v":""},null,"","","",null,0,0,1,0,null,"",0.5,"",null,null,null,null,null,null,null,null,null,null,null,null,null,null,null,32,{"$f":"Visualization!$S$20","v":0},{"$f":"Visualization!$S$21","v":0},{"$f":"Calculation!$AQ$5","v":""},{"$f":"Calculation!$AQ$6","v":""},{"$f":"Calculation!$AQ$7","v":""},{"$f":"Calculation!$AQ$8","v":""},{"$f":"Calculation!$AQ$9","v":""},{"$f":"Calculation!$AQ$10","v":""},{"$f":"Calculation!$AQ$11","v":""},{"$f":"Calculation!$AQ$12","v":""},{"$f":"Calculation!$AQ$13","v":""},{"$f":"Calculation!$AQ$14","v":""}]
[null,"",32,{"$f":"IF(Values!C36=\"\",\"\",Values!C36)","v":""},{"$f":"IF(Values!D36=\"\",\"\",Values!D36)","v":""},{"$f":"IF(Values!E36=\"\",\"\",Values!E36)","v":""},{"$f":"IF(Values!F36=\"\",\"\",Values!F36)","v":""},{"$f":"IF(Values!G36=\"\",\"\",Values!G36)","v":""},{"$f":"IF(Values!H36=\"\",\"\",Values!H36)","v":""},{"$f":"IF(Values!I36=\"\",\"\",Values!I36)","v":""},{"$f":"IF(Values!J36=\"\",\"\",Values!J36)","v":""},{"$f":"IF(Values!K36=\"\",\"\",Values!K36)","v":""},{"$f":"IF(Values!L36=\"\",\"\",Values!L36)","v":""},null,"",32,"","","","","","","","","","",{"$f":"IF(AJ36=1,IF(Q36-Visualization!$S$20>Visualization!$S$21-Q36,\"USL\",\"LSL\"),\"\")","v":""},null,"","","",null,0,0,1,0,null,"",0.5,"",null,null,null,null,null,null,null,null,null,null,null,null,null,null,null,33,{"$f":"Visualization!$S$20","v":0},{"$f":"Visualization!$S$21","v":0},{"$f":"Calculation!$AQ$5","v":""},{"$f":"Calculation!$AQ$6","v":""},{"$f":"Calculation!$AQ$7","v":""},{"$f":"Calculation!$AQ$8","v":""},{"$f":"Calculation!$AQ$9","v":""},{"$f":"Calculation!$AQ$10","v":""},{"$f":"Calculation!$AQ$11","v":""},{"$f":"Calculation!$AQ$12","v":""},{"$f":"Calculation!$AQ$13","v":""},{"$f":"Calculation!$AQ$14","v":""}]
[null,"",33,{"$f":"IF(Values!C37=\"\",\"\",Values!C37)","v":""},{"$f":"IF(Values!D37=\"\",\"\",Values!D37)","v":""},{"$f":"IF(Values!E37=\"\",\"\",Values!E37)","v":""},{"$f":"IF(Values!F37=\"\",\"\",Values!F37)","v":""},{"$f":"IF(Values!G37=\"\",\"\",Values!G37)","v":""},{"$f":"IF(Values!H37=\"\",\"\",Values!H37)","v":""},{"$f":"IF(Values!I37=\"\",\"\",Values!I37)","v":""},{"$f":"IF(Values!J37=\"\",\"\",Values!J37)","v":""},{"$f":"IF(Values!K37=\"\",\"\",Values!K37)","v":""},{"$f":"IF(Values!L37=\"\",\"\",Values!L37)","v":""},null,{"$f":"IF(B37=\"\",\"\",VLOOKUP(P37,$B$5:$D$54,2,FALSE))","v":""},33,"","","","","","","","","","",{"$f":"IF(AJ37=1,IF(Q37-Visualization!$S$20>Visualization!$S$21-Q37,\"USL\",\"LSL\"),\"\")","v":""},null,"","","",null,0,0,1,0,null,{"$f":"IF(AN37=\"\",\"\",RANK(AN37,$AN$5:$AN$54))","v":""},0.5,{"$f":"IF(OR(AND(AM37=1,AM36=0.5),AND(AM37=1,AM38=0.5)),Q37,\"\")","v":""},null,null,null,null,null,null,null,null,null,null,null,null,null,null,null,34,{"$f":"Visualization!$S$20","v":0},{"$f":"Visualization!$S$21","v":0},{"$f":"Calculation!$AQ$5","v":""},{"$f":"Calculation!$AQ$6","v":""},{"$f":"Calculation!$AQ$7","v":""},{"$f":"Calculation!$AQ$8","v":""},{"$f":"Calculation!$AQ$9","v":""},{"$f":"Calculation!$AQ$10","v":""},{"$f":"Calculation!$AQ$11","v":""},{"$f":"Calculation!$AQ$12","v":""},{"$f":"Calculation!$AQ$13","v":""},{"$f":"Calculation!$AQ$14","v":""}]
[null,"",34,{"$f":"IF(Values!C38=\"\",\"\",Values!C38)","v":""},{"$f":"IF(Values!D38=\"\",\"\",Values!D38)","v":""},{"$f":"IF(Values!E38=\"\",\"\",Values!E38)","v":""},{"$f":"IF(Values!F38=\"\",\"\",Values!F38)","v":""},{"$f":"IF(Values!G38=\"\",\"\",Values!G38)","v":""},{"$f":"IF(Values!H38=\"\",\"\",Values!H38)","v":""},{"$f":"IF(Values!I38=\"\",\"\",Values!I38)","v":""},{"$f":"IF(Values!J38=\"\",\"\",Values!J38)","v":""},{"$f":"IF(Values!K38=\"\",\"\",Values!K38)","v":""},{"$f":"IF(Values!L38=\"\",\"\",Values!L38)","v":""},null,"",34,"","","","","","","","","","",{"$f":"IF(AJ38=1,IF(Q38-Visualization!$S$20>Visualization!$S$21-Q38,\"USL\",\"LSL\"),\"\")","v":""},null,"","","",null,0,0,1,0,null,"",0.5,"",null,null,null,null,null,null,null,null,null,null,null,null,null,null,null,35,{"$f":"Visualization!$S$20","v":0},{"$f":"Visualization!$S$21","v":0},{"$f":"Calculation!$AQ$5","v":""},{"$f":"Calculation!$AQ$6","v":""},{"$f":"Calculation!$AQ$7","v":""},{"$f":"Calculation!$AQ$8","v":""},{"$f":"Calculation!$AQ$9","v":""},{"$f":"Calculation!$AQ$10","v":""},{"$f":"Calculation!$AQ$11","v":""},{"$f":"Calculation!$AQ$12","v":""},{"$f":"Calculation!$AQ$13","v":""},{"$f":"Calculation!$AQ$14","v":""}]
[null,"",35,{"$f":"IF(Values!C39=\"\",\"\",Values!C39)","v":""},{"$f":"IF(Values!D39=\"\",\"\",Values!D39)","v":""},{"$f":"IF(Values!E39=\"\",\"\",Values!E39)","v":""},{"$f":"IF(Values!F39=\"\",\"\",Values!F39)","v":""},{"$f":"IF(Values!G39=\"\",\"\",Values!G39)","v":""},{"$f":"IF(Values!H39=\"\",\"\",Values!H39)","v":""},{"$f":"IF(Values!I39=\"\",\"\",Values!I39)","v":""},{"$f":"IF(Values!J39=\"\",\"\",Values!J39)","v":""},{"$f":"IF(Values!K39=\"\",\"\",Values!K39)","v":""},{"$f":"IF(Values!L39=\"\",\"\",Values!L39)","v":""},null,"",35,"","","","","","","","","","",{"$f":"IF(AJ39=1,IF(Q39-Visualization!$S$20>Visualization!$S$21-Q39,\"USL\",\"LSL\"),\"\")","v":""},null,"","","",null,0,0,1,0,null,"",0.5,"",null,null,null,null,null,null,null,null,null,null,null,null,null,null,null,36,{"$f":"Visualization!$S$20","v":0},{"$f":"Visualization!$S$21","v":0},{"$f":"Calculation!$AQ$5","v":""},{"$f":"Calculation!$AQ$6","v":""},{"$f":"Calculation!$AQ$7","v":""},{"$f":"Calculation!$AQ$8","v":""},{"$f":"Calculation!$AQ$9","v":""},{"$f":"Calculation!$AQ$10","v":""},{"$f":"Calculation!$AQ$11","v":""},{"$f":"Calculation!$AQ$12","v":""},{"$f":"Calculation!$AQ$13","v":""},{"$f":"Calculation!$AQ$14","v":""}]
[null,"",36,{"$f":"IF(Values!C40=\"\",\"\",Values!C40)","v":""},{"$f":"IF(Values!D40=\"\",\"\",Values!D40)","v":""},{"$f":"IF(Values!E40=\"\",\"\",Values!E40)","v":""},{"$f":"IF(Values!F40=\"\",\"\",Values!F40)","v":""},{"$f":"IF(Values!G40=\"\",\"\",Values!G40)","v":""},{"$f":"IF(Values!H40=\"\",\"\",Values!H40)","v":""},{"$f":"IF(Values!I40=\"\",\"\",Values!I40)","v":""},{"$f":"IF(Values!J40=\"\",\"\",Values!J40)","v":""},{"$f":"IF(Values!K40=\"\",\"\",Values!K40)","v":""},{"$f":"IF(Values!L40=\"\",\"\",Values!L40)","v":""},null,"",36,"","","","","","","","","","",{"$f":"IF(AJ40=1,IF(Q40-Visualization!$S$20>Visualization!$S$21-Q40,\"USL\",\"LSL\"),\"\")","v":""},null,"","","",null,0,0,1,0,null,"",0.5,"",null,null,null,null,null,null,null,null,null,null,null,null,null,null,null,37,{"$f":"Visualization!$S$20","v":0},{"$f":"Visualization!$S$21","v":0},{"$f":"Calculation!$AQ$5","v":""},{"$f":"Calculation!$AQ$6","v":""},{"$f":"Calculation!$AQ$7","v":""},{"$f":"Calculation!$AQ$8","v":""},{"$f":"Calculation!$AQ$9","v":""},{"$f":"Calculation!$AQ$10","v":""},{"$f":"Calculation!$AQ$11","v":""},{"$f":"Calculation!$AQ$12","v":""},{"$f":"Calculation!$AQ$13","v":""},{"$f":"Calculation!$AQ$14","v":""}]
[null,"",37,{"$f":"IF(Values!C41=\"\",\"\",Values!C41)","v":""},{"$f":"IF(Values!D41=\"\",\"\",Values!D41)","v":""},{"$f":"IF(Values!E41=\"\",\"\",Values!E41)","v":""},{"$f":"IF(Values!F41=\"\",\"\",Values!F41)","v":""},{"$f":"IF(Values!G41=\"\",\"\",Values!G41)","v":""},{"$f":"IF(Values!H41=\"\",\"\",Values!H41)","v":""},{"$f":"IF(Values!I41=\"\",\"\",Values!I41)","v":""},{"$f":"IF(Values!J41=\"\",\"\",Values!J41)","v":""},{"$f":"IF(Values!K41=\"\",\"\",Values!K41)","v":""},{"$f":"IF(Values!L41=\"\",\"\",Values!L41)","v":""},null,"",37,"","","","","","","","","","",{"$f":"IF(AJ41=1,IF(Q41-Visualization!$S$20>Visualization!$S$21-Q41,\"USL\",\"LSL\"),\"\")","v":""},null,"","","",null,0,0,1,0,null,"",0.5,"",null,null,"Additional Pro.File variables",null,null,null,null,null,null,null,null,null,null,null,null,38,{"$f":"Visualization!$S$20","v":0},{"$f":"Visualization!$S$21","v":0},{"$f":"Calculation!$AQ$5","v":""},{"$f":"Calculation!$AQ$6","v":""},{"$f":"Calculation!$AQ$7","v":""},{"$f":"Calculation!$AQ$8","v":""},{"$f":"Calculation!$AQ$9","v":""},{"$f":"Calculation!$AQ$10","v":""},{"$f":"Calculation!$AQ$11","v":""},{"$f":"Calculation!$AQ$12","v":""},{"$f":"Calculation!$AQ$13","v":""},{"$f":"Calculation!$AQ$14","v":""}]
[null,"",38,{"$f":"IF(Values!C42=\"\",\"\",Values!C42)","v":""},{"$f":"IF(Values!D42=\"\",\"\",Values!D42)","v":""},{"$f":"IF(Values!E42=\"\",\"\",Values!E42)","v":""},{"$f":"IF(Values!F42=\"\",\"\",Values!F42)","v":""},{"$f":"IF(Values!G42=\"\",\"\",Values!G42)","v":""},{"$f":"IF(Values!H42=\"\",\"\",Values!H42)","v":""},{"$f":"IF(Values!I42=\"\",\"\",Values!I42)","v":""},{"$f":"IF(Values!J42=\"\",\"\",Values!J42)","v":""},{"$f":"IF(Values!K42=\"\",\"\",Values!K42)","v":""},{"$f":"IF(Values!L42=\"\",\"\",Values!L42)","v":""},null,"",38,"","","","","","","","","","",{"$f":"IF(AJ42=1,IF(Q42-Visualization!$S$20>Visualization!$S$21-Q42,\"USL\",\"LSL\"),\"\")","v":""},null,"","","",null,0,0,1,0,null,"",0.5,"",null,null,"Resolution",{"$f":"VALUE(PRODSTRING15)","v":0},null,null,null,null,null,null,null,null,null,null,null,39,{"$f":"Visualization!$S$20","v":0},{"$f":"Visualization!$S$21","v":0},{"$f":"Calculation!$AQ$5","v":""},{"$f":"Calculation!$AQ$6","v":""},{"$f":"Calculation!$AQ$7","v":""},{"$f":"Calculation!$AQ$8","v":""},{"$f":"Calculation!$AQ$9","v":""},{"$f":"Calculation!$AQ$10","v":""},{"$f":"Calculation!$AQ$11","v":""},{"$f":"Calculation!$AQ$12","v":""},{"$f":"Calculation!$AQ$13","v":""},{"$f":"Calculation!$AQ$14","v":""}]
[null,"",39,{"$f":"IF(Values!C43=\"\",\"\",Values!C43)","v":""},{"$f":"IF(Values!D43=\"\",\"\",Values!D43)","v":""},{"$f":"IF(Values!E43=\"\",\"\",Values!E43)","v":""},{"$f":"IF(Values!F43=\"\",\"\",Values!F43)","v":""},{"$f":"IF(Values!G43=\"\",\"\",Values!G43)","v":""},{"$f":"IF(Values!H43=\"\",\"\",Values!H43)","v":""},{"$f":"IF(Values!I43=\"\",\"\",Values!I43)","v":""},{"$f":"IF(Values!J43=\"\",\"\",Values!J43)","v":""},{"$f":"IF(Values!K43=\"\",\"\",Values!K43)","v":""},{"$f":"IF(Values!L43=\"\",\"\",Values!L43)","v":""},null,"",39,"","","","","","","","","","",{"$f":"IF(AJ43=1,IF(Q43-Visualization!$S$20>Visualization!$S$21-Q43,\"USL\",\"LSL\"),\"\")","v":""},null,"","","",null,0,0,1,0,null,"",0.5,"",null,null,"USL",{"$f":"VALUE(PRODSTRING17)","v":0},null,null,null,null,null,null,null,null,null,null,null,40,{"$f":"Visualization!$S$20","v":0},{"$f":"Visualization!$S$21","v":0},{"$f":"Calculation!$AQ$5","v":""},{"$f":"Calculation!$AQ$6","v":""},{"$f":"Calculation!$AQ$7","v":""},{"$f":"Calculation!$AQ$8","v":""},{"$f":"Calculation!$AQ$9","v":""},{"$f":"Calculation!$AQ$10","v":""},{"$f":"Calculation!$AQ$11","v":""},{"$f":"Calculation!$AQ$12","v":""},{"$f":"Calculation!$AQ$13","v":""},{"$f":"Calculation!$AQ$14","v":""}]
[null,"",40,{"$f":"IF(Values!C44=\"\",\"\",Values!C44)","v":""},{"$f":"IF(Values!D44=\"\",\"\",Values!D44)","v":""},{"$f":"IF(Values!E44=\"\",\"\",Values!E44)","v":""},{"$f":"IF(Values!F44=\"\",\"\",Values!F44)","v":""},{"$f":"IF(Values!G44=\"\",\"\",Values!G44)","v":""},{"$f":"IF(Values!H44=\"\",\"\",Values!H44)","v":""},{"$f":"IF(Values!I44=\"\",\"\",Values!I44)","v":""},{"$f":"IF(Values!J44=\"\",\"\",Values!J44)","v":""},{"$f":"IF(Values!K44=\"\",\"\",Values!K44)","v":""},{"$f":"IF(Values!L44=\"\",\"\",Values!L44)","v":""},null,"",40,"","","","","","","","","","",{"$f":"IF(AJ44=1,IF(Q44-Visualization!$S$20>Visualization!$S$21-Q44,\"USL\",\"LSL\"),\"\")","v":""},null,"","","",null,0,0,1,0,null,"",0.5,"",null,null,"LSL",{"$f":"VALUE(PRODSTRING18)","v":0},null,null,null,null,null,null,null,null,null,null,null,41,{"$f":"Visualization!$S$20","v":0},{"$f":"Visualization!$S$21","v":0},{"$f":"Calculation!$AQ$5","v":""},{"$f":"Calculation!$AQ$6","v":""},{"$f":"Calculation!$AQ$7","v":""},{"$f":"Calculation!$AQ$8","v":""},{"$f":"Calculation!$AQ$9","v":""},{"$f":"Calculation!$AQ$10","v":""},{"$f":"Calculation!$AQ$11","v":""},{"$f":"Calculation!$AQ$12","v":""},{"$f":"Calculation!$AQ$13","v":""},{"$f":"Calculation!$AQ$14","v":""}]
[null,"",41,{"$f":"IF(Values!C45=\"\",\"\",Values!C45)","v":""},{"$f":"IF(Values!D45=\"\",\"\",Values!D45)","v":""},{"$f":"IF(Values!E45=\"\",\"\",Values!E45)","v":""},{"$f":"IF(Values!F45=\"\",\"\",Values!F45)","v":""},{"$f":"IF(Values!G45=\"\",\"\",Values!G45)","v":""},{"$f":"IF(Values!H45=\"\",\"\",Values!H45)","v":""},{"$f":"IF(Values!I45=\"\",\"\",Values!I45)","v":""},{"$f":"IF(Values!J45=\"\",\"\",Values!J45)","v":""},{"$f":"IF(Values!K45=\"\",\"\",Values!K45)","v":""},{"$f":"IF(Values!L45=\"\",\"\",Values!L45)","v":""},null,"",41,"","","","","","","","","","",{"$f":"IF(AJ45=1,IF(Q45-Visualization!$S$20>Visualization!$S$21-Q45,\"USL\",\"LSL\"),\"\")","v":""},null,"","","",null,0,0,1,0,null,"",0.5,"",null,null,null,null,null,null,null,null,null,null,null,null,null,null,null,42,{"$f":"Visualization!$S$20","v":0},{"$f":"Visualization!$S$21","v":0},{"$f":"Calculation!$AQ$5","v":""},{"$f":"Calculation!$AQ$6","v":""},{"$f":"Calculation!$AQ$7","v":""},{"$f":"Calculation!$AQ$8","v":""},{"$f":"Calculation!$AQ$9","v":""},{"$f":"Calculation!$AQ$10","v":""},{"$f":"Calculation!$AQ$11","v":""},{"$f":"Calculation!$AQ$12","v":""},{"$f":"Calculation!$AQ$13","v":""},{"$f":"Calculation!$AQ$14","v":""}]
[null,"",42,{"$f":"IF(Values!C46=\"\",\"\",Values!C46)","v":""},{"$f":"IF(Values!D46=\"\",\"\",Values!D46)","v":""},{"$f":"IF(Values!E46=\"\",\"\",Values!E46)","v":""},{"$f":"IF(Values!F46=\"\",\"\",Values!F46)","v":""},{"$f":"IF(Values!G46=\"\",\"\",Values!G46)","v":""},{"$f":"IF(Values!H46=\"\",\"\",Values!H46)","v":""},{"$f":"IF(Values!I46=\"\",\"\",Values!I46)","v":""},{"$f":"IF(Values!J46=\"\",\"\",Values!J46)","v":""},{"$f":"IF(Values!K46=\"\",\"\",Values!K46)","v":""},{"$f":"IF(Values!L46=\"\",\"\",Values!L46)","v":""},null,"",42,"","","","","","","","","","",{"$f":"IF(AJ46=1,IF(Q46-Visualization!$S$20>Visualization!$S$21-Q46,\"USL\",\"LSL\"),\"\")","v":""},null,"","","",null,0,0,1,0,null,"",0.5,"",null,null,null,null,null,null,null,null,null,null,null,null,null,null,null,43,{"$f":"Visualization!$S$20","v":0},{"$f":"Visualization!$S$21","v":0},{"$f":"Calculation!$AQ$5","v":""},{"$f":"Calculation!$AQ$6","v":""},{"$f":"Calculation!$AQ$7","v":""},{"$f":"Calculation!$AQ$8","v":""},{"$f":"Calculation!$AQ$9","v":""},{"$f":"Calculation!$AQ$10","v":""},{"$f":"Calculation!$AQ$11","v":""},{"$f":"Calculation!$AQ$12","v":""},{"$f":"Calculation!$AQ$13","v":""},{"$f":"Calculation!$AQ$14","v":""}]
[null,"",43,{"$f":"IF(Values!C47=\"\",\"\",Values!C47)","v":""},{"$f":"IF(Values!D47=\"\",\"\",Values!D47)","v":""},{"$f":"IF(Values!E47=\"\",\"\",Values!E47)","v":""},{"$f":"IF(Values!F47=\"\",\"\",Values!F47)","v":""},{"$f":"IF(Values!G47=\"\",\"\",Values!G47)","v":""},{"$f":"IF(Values!H47=\"\",\"\",Values!H47)","v":""},{"$f":"IF(Values!I47=\"\",\"\",Values!I47)","v":""},{"$f":"IF(Values!J47=\"\",\"\",Values!J47)","v":""},{"$f":"IF(Values!K47=\"\",\"\",Values!K47)","v":""},{"$f":"IF(Values!L47=\"\",\"\",Values!L47)","v":""},null,"",43,"","","","","","","","","","",{"$f":"IF(AJ47=1,IF(Q47-Visualization!$S$20>Visualization!$S$21-Q47,\"USL\",\"LSL\"),\"\")","v":""},null,"","","",null,0,0,1,0,null,"",0.5,"",null,null,null,null,null,null,null,null,null,null,null,null,null,null,null,44,{"$f":"Visualization!$S$20","v":0},{"$f":"Visualization!$S$21","v":0},{"$f":"Calculation!$AQ$5","v":""},{"$f":"Calculation!$AQ$6","v":""},{"$f":"Calculation!$AQ$7","v":""},{"$f":"Calculation!$AQ$8","v":""},{"$f":"Calculation!$AQ$9","v":""},{"$f":"Calculation!$AQ$10","v":""},{"$f":"Calculation!$AQ$11","v":""},{"$f":"Calculation!$AQ$12","v":""},{"$f":"Calculation!$AQ$13","v":""},{"$f":"Calculation!$AQ$14","v":""}]
[null,"",44,{"$f":"IF(Values!C48=\"\",\"\",Values!C48)","v":""},{"$f":"IF(Values!D48=\"\",\"\",Values!D48)","v":""},{"$f":"IF(Values!E48=\"\",\"\",Values!E48)","v":""},{"$f":"IF(Values!F48=\"\",\"\",Values!F48)","v":""},{"$f":"IF(Values!G48=\"\",\"\",Values!G48)","v":""},{"$f":"IF(Values!H48=\"\",\"\",Values!H48)","v":""},{"$f":"IF(Values!I48=\"\",\"\",Values!I48)","v":""},{"$f":"IF(Values!J48=\"\",\"\",Values!J48)","v":""},{"$f":"IF(Values!K48=\"\",\"\",Values!K48)","v":""},{"$f":"IF(Values!L48=\"\",\"\",Values!L48)","v":""},null,"",44,"","","","","","","","","","",{"$f":"IF(AJ48=1,IF(Q48-Visualization!$S$20>Visualization!$S$21-Q48,\"USL\",\"LSL\"),\"\")","v":""},null,"","","",null,0,0,1,0,null,"",0.5,"",null,null,null,null,null,null,null,null,null,null,null,null,null,null,null,45,{"$f":"Visualization!$S$20","v":0},{"$f":"Visualization!$S$21","v":0},{"$f":"Calculation!$AQ$5","v":""},{"$f":"Calculation!$AQ$6","v":""},{"$f":"Calculation!$AQ$7","v":""},{"$f":"Calculation!$AQ$8","v":""},{"$f":"Calculation!$AQ$9","v":""},{"$f":"Calculation!$AQ$10","v":""},{"$f":"Calculation!$AQ$11","v":""},{"$f":"Calculation!$AQ$12","v":""},{"$f":"Calculation!$AQ$13","v":""},{"$f":"Calculation!$AQ$14","v":""}]
[null,"",45,{"$f":"IF(Values!C49=\"\",\"\",Values!C49)","v":""},{"$f":"IF(Values!D49=\"\",\"\",Values!D49)","v":""},{"$f":"IF(Values!E49=\"\",\"\",Values!E49)","v":""},{"$f":"IF(Values!F49=\"\",\"\",Values!F49)","v":""},{"$f":"IF(Values!G49=\"\",\"\",Values!G49)","v":""},{"$f":"IF(Values!H49=\"\",\"\",Values!H49)","v":""},{"$f":"IF(Values!I49=\"\",\"\",Values!I49)","v":""},{"$f":"IF(Values!J49=\"\",\"\",Values!J49)","v":""},{"$f":"IF(Values!K49=\"\",\"\",Values!K49)","v":""},{"$f":"IF(Values!L49=\"\",\"\",Values!L49)","v":""},null,"",45,"","","","","","","","","","",{"$f":"IF(AJ49=1,IF(Q49-Visualization!$S$20>Visualization!$S$21-Q49,\"USL\",\"LSL\"),\"\")","v":""},null,"","","",null,0,0,1,0,null,"",0.5,"",null,null,null,null,null,null,null,null,null,null,null,null,null,null,null,46,{"$f":"Visualization!$S$20","v":0},{"$f":"Visualization!$S$21","v":0},{"$f":"Calculation!$AQ$5","v":""},{"$f":"Calculation!$AQ$6","v":""},{"$f":"Calculation!$AQ$7","v":""},{"$f":"Calculation!$AQ$8","v":""},{"$f":"Calculation!$AQ$9","v":""},{"$f":"Calculation!$AQ$10","v":""},{"$f":"Calculation!$AQ$11","v":""},{"$f":"Calculation!$AQ$12","v":""},{"$f":"Calculation!$AQ$13","v":""},{"$f":"Calculation!$AQ$14","v":""}]
[null,"",46,{"$f":"IF(Values!C50=\"\",\"\",Values!C50)","v":""},{"$f":"IF(Values!D50=\"\",\"\",Values!D50)","v":""},{"$f":"IF(Values!E50=\"\",\"\",Values!E50)","v":""},{"$f":"IF(Values!F50=\"\",\"\",Values!F50)","v":""},{"$f":"IF(Values!G50=\"\",\"\",Values!G50)","v":""},{"$f":"IF(Values!H50=\"\",\"\",Values!H50)","v":""},{"$f":"IF(Values!I50=\"\",\"\",Values!I50)","v":""},{"$f":"IF(Values!J50=\"\",\"\",Values!J50)","v":""},{"$f":"IF(Values!K50=\"\",\"\",Values!K50)","v":""},{"$f":"IF(Values!L50=\"\",\"\",Values!L50)","v":""},null,"",46,"","","","","","","","","","",{"$f":"IF(AJ50=1,IF(Q50-Visualization!$S$20>Visualization!$S$21-Q50,\"USL\",\"LSL\"),\"\")","v":""},null,"","","",null,0,0,1,0,null,"",0.5,"",null,null,null,null,null,null,null,null,null,null,null,null,null,null,null,47,{"$f":"Visualization!$S$20","v":0},{"$f":"Visualization!$S$21","v":0},{"$f":"Calculation!$AQ$5","v":""},{"$f":"Calculation!$AQ$6","v":""},{"$f":"Calculation!$AQ$7","v":""},{"$f":"Calculation!$AQ$8","v":""},{"$f":"Calculation!$AQ$9","v":""},{"$f":"Calculation!$AQ$10","v":""},{"$f":"Calculation!$AQ$11","v":""},{"$f":"Calculation!$AQ$12","v":""},{"$f":"Calculation!$AQ$13","v":""},{"$f":"Calculation!$AQ$14","v":""}]
[null,"",47,{"$f":"IF(Values!C51=\"\",\"\",Values!C51)","v":""},{"$f":"IF(Values!D51=\"\",\"\",Values!D51)","v":""},{"$f":"IF(Values!E51=\"\",\"\",Values!E51)","v":""},{"$f":"IF(Values!F51=\"\",\"\",Values!F51)","v":""},{"$f":"IF(Values!G51=\"\",\"\",Values!G51)","v":""},{"$f":"IF(Values!H51=\"\",\"\",Values!H51)","v":""},{"$f":"IF(Values!I51=\"\",\"\",Values!I51)","v":""},{"$f":"IF(Values!J51=\"\",\"\",Values!J51)","v":""},{"$f":"IF(Values!K51=\"\",\"\",Values!K51)","v":""},{"$f":"IF(Values!L51=\"\",\"\",Values!L51)","v":""},null,"",47,"","","","","","","","","","",{"$f":"IF(AJ51=1,IF(Q51-Visualization!$S$20>Visualization!$S$21-Q51,\"USL\",\"LSL\"),\"\")","v":""},null,"","","",null,0,0,1,0,null,"",0.5,"",null,null,null,null,null,null,null,null,null,null,null,null,null,null,null,48,{"$f":"Visualization!$S$20","v":0},{"$f":"Visualization!$S$21","v":0},{"$f":"Calculation!$AQ$5","v":""},{"$f":"Calculation!$AQ$6","v":""},{"$f":"Calculation!$AQ$7","v":""},{"$f":"Calculation!$AQ$8","v":""},{"$f":"Calculation!$AQ$9","v":""},{"$f":"Calculation!$AQ$10","v":""},{"$f":"Calculation!$AQ$11","v":""},{"$f":"Calculation!$AQ$12","v":""},{"$f":"Calculation!$AQ$13","v":""},{"$f":"Calculation!$AQ$14","v":""}]
[null,"",48,{"$f":"IF(Values!C52=\"\",\"\",Values!C52)","v":""},{"$f":"IF(Values!D52=\"\",\"\",Values!D52)","v":""},{"$f":"IF(Values!E52=\"\",\"\",Values!E52)","v":""},{"$f":"IF(Values!F52=\"\",\"\",Values!F52)","v":""},{"$f":"IF(Values!G52=\"\",\"\",Values!G52)","v":""},{"$f":"IF(Values!H52=\"\",\"\",Values!H52)","v":""},{"$f":"IF(Values!I52=\"\",\"\",Values!I52)","v":""},{"$f":"IF(Values!J52=\"\",\"\",Values!J52)","v":""},{"$f":"IF(Values!K52=\"\",\"\",Values!K52)","v":""},{"$f":"IF(Values!L52=\"\",\"\",Values!L52)","v":""},null,"",48,"","","","","","","","","","",{"$f":"IF(AJ52=1,IF(Q52-Visualization!$S$20>Visualization!$S$21-Q52,\"USL\",\"LSL\"),\"\")","v":""},null,"","","",null,0,0,1,0,null,"",0.5,"",null,null,null,null,null,null,null,null,null,null,null,null,null,null,null,49,{"$f":"Visualization!$S$20","v":0},{"$f":"Visualization!$S$21","v":0},{"$f":"Calculation!$AQ$5","v":""},{"$f":"Calculation!$AQ$6","v":""},{"$f":"Calculation!$AQ$7","v":""},{"$f":"Calculation!$AQ$8","v":""},{"$f":"Calculation!$AQ$9","v":""},{"$f":"Calculation!$AQ$10","v":""},{"$f":"Calculation!$AQ$11","v":""},{"$f":"Calculation!$AQ$12","v":""},{"$f":"Calculation!$AQ$13","v":""},{"$f":"Calculation!$AQ$14","v":""}]
[null,"",49,{"$f":"IF(Values!C53=\"\",\"\",Values!C53)","v":""},{"$f":"IF(Values!D53=\"\",\"\",Values!D53)","v":""},{"$f":"IF(Values!E53=\"\",\"\",Values!E53)","v":""},{"$f":"IF(Values!F53=\"\",\"\",Values!F53)","v":""},{"$f":"IF(Values!G53=\"\",\"\",Values!G53)","v":""},{"$f":"IF(Values!H53=\"\",\"\",Values!H53)","v":""},{"$f":"IF(Values!I53=\"\",\"\",Values!I53)","v":""},{"$f":"IF(Values!J53=\"\",\"\",Values!J53)","v":""},{"$f":"IF(Values!K53=\"\",\"\",Values!K53)","v":""},{"$f":"IF(Values!L53=\"\",\"\",Values!L53)","v":""},null,"",49,"","","","","","","","","","",{"$f":"IF(AJ53=1,IF(Q53-Visualization!$S$20>Visualization!$S$21-Q53,\"USL\",\"LSL\"),\"\")","v":""},null,"","","",null,0,0,1,0,null,"",0.5,"",null,null,null,null,null,null,null,null,null,null,null,null,null,null,null,50,{"$f":"Visualization!$S$20","v":0},{"$f":"Visualization!$S$21","v":0},{"$f":"Calculation!$AQ$5","v":""},{"$f":"Calculation!$AQ$6","v":""},{"$f":"Calculation!$AQ$7","v":""},{"$f":"Calculation!$AQ$8","v":""},{"$f":"Calculation!$AQ$9","v":""},{"$f":"Calculation!$AQ$10","v":""},{"$f":"Calculation!$AQ$11","v":""},{"$f":"Calculation!$AQ$12","v":""},{"$f":"Calculation!$AQ$13","v":""},{"$f":"Calculation!$AQ$14","v":""}]
[null,"",50,{"$f":"IF(Values!C54=\"\",\"\",Values!C54)","v":""},{"$f":"IF(Values!D54=\"\",\"\",Values!D54)","v":""},{"$f":"IF(Values!E54=\"\",\"\",Values!E54)","v":""},{"$f":"IF(Values!F54=\"\",\"\",Values!F54)","v":""},{"$f":"IF(Values!G54=\"\",\"\",Values!G54)","v":""},{"$f":"IF(Values!H54=\"\",\"\",Values!H54)","v":""},{"$f":"IF(Values!I54=\"\",\"\",Values!I54)","v":""},{"$f":"IF(Values!J54=\"\",\"\",Values!J54)","v":""},{"$f":"IF(Values!K54=\"\",\"\",Values!K54)","v":""},{"$f":"IF(Values!L54=\"\",\"\",Values!L54)","v":""},null,"",50,"","","","","","","","","","",{"$f":"IF(AJ54=1,IF(Q54-Visualization!$S$20>Visualization!$S$21-Q54,\"USL\",\"LSL\"),\"\")","v":""},null,"","","",null,0,0,1,0,null,"",0.5,""]

{"sheet":"Settings","index":5,"n_rows":26,"n_cols":8,"rows_kept":26,"cut":false,"hidden":true,"merged":[[23,7,24,10],[23,11,24,13],[25,7,26,10],[25,11,26,13],[19,4,19,5],[19,7,20,10],[19,11,20,13],[21,7,22,10],[21,11,22,13],[22,1,22,3],[6,7,8,13],[7,1,7,2],[7,3,7,5],[13,7,14,10],[16,1,16,5],[17,4,18,5],[10,1,10,5],[11,4,12,5],[13,4,13,5]]}
[]
[]
[]
[]
[]
[]
[null,null,null,null,null,null,null,"The integrated macros in this Worksheet are not required for the calculation. The macros just handle the scaling of the integrated charts. If you do not activate the macros, the sheet is still capable to calculate trustwothy indicies."]
[null,"Scale on",null,"Values"]
[]
[]
[null,"Scale on Specification"]
[null,null,"Upper","Lower","Scale-Factor \n(Standart = 0,3)"]
[null,"Max/Min",{"$f":"Visualization!S20","v":0},{"$f":"Visualization!S21","v":0}]
[null,"Scale on",{"$f":"IF(C13=\"\",\"\",C13+(C13-D13)*E14)","v":0},{"$f":"IF(D13=\"\",\"\",D13-(C13-D13)*E14)","v":0},0.3,null,null,"Print a pdf of the register \"Visualization\" to a folder of your choice."]
[]
[]
[null,"Scale on Values"]
[null,null,"Upper","Lower","Scale-Factor \n(Standart = 0,3)"]
[null,"Max/Min",{"$f":"Calculation!AR27","v":""},{"$f":"Calculation!AR28","v":""}]
[null,"Scale on",{"$f":"IF(C19=\"\",\"\",C19+(C19-D19)*E20)","v":""},{"$f":"IF(D19=\"\",\"\",D19-(C19-D19)*E20)","v":""},0.1,null,null,"Guide (A \"How to\" handle the document)"]
[]
[null,null,null,null,null,null,null,"Calculations (Distribution; Graphics; Indices)"]
[null,"Custom scaling"]
[null,null,"Lower","Upper",null,null,null,"Directories (Resolution, Measrumentdevices, Units)"]
[null,"Scale on"]
[null,null,null,null,null,null,null,"References (Calculation references)"]

{"sheet":"References","index":6,"n_rows":13,"n_cols":2,"rows_kept":13,"cut":false,"hidden":true,"merged":[[3,1,8,9],[12,1,13,7]]}
[]
[]
[]
[null,"Calculation according \"Measurement System Capability\" Reference Manual.\n\nHead of work group:\nDr. Edgar Dietrich\n\n(Status: 17. September 2002)"]
[]
[]
[]
[]
[]
[]
[]
[]
[null,"Detailed references and calculation information are located in the Managment System doc-nr. 1758."]

{"sheet":"Directories","index":7,"n_rows":4,"n_cols":6,"rows_kept":4,"cut":false,"hidden":true,"merged":[]}
[]
[]
[]
[null,"Resolution",null,"Unit",null,"Measurement system"]