{"text_format":"1","workbook":"xlsx","n_sheets":6,"sheets":["Cover Sheet - Deckblatt","Tabelle zu 3.5a","Tabelle zu 3.5b","Tabelle zu 3.11","Tabelle zu 3.10b","Tabelle zu 3.5c"],"not_rendered":{"charts":3,"images":0,"macros":1,"external_links":6,"defined_names":41,"comments":0,"pivot_tables":0},"unopened":[],"bounds":{"document_bytes":16777216,"sheet_cells":100000,"rows_first":2000,"rows_last":500,"rows_between":2000,"halvings":0,"cell_chars":16384,"cell_head_chars":4096},"cells_cut":0,"cells_raw":0,"read":"whole","date_system":"1900"}

{"sheet":"Cover Sheet - Deckblatt","index":0,"n_rows":42,"n_cols":62,"rows_kept":42,"cut":false,"hidden":false,"merged":[[30,36,31,36],[30,37,31,37],[8,1,8,61],[9,1,9,61],[18,1,18,61],[30,25,31,28],[30,21,31,24],[30,33,31,33],[30,34,31,34],[30,35,31,35],[30,32,31,32],[30,43,31,43],[28,1,31,20],[28,21,28,61],[20,1,20,9],[27,44,27,61],[20,45,20,48],[20,49,20,53],[25,1,25,3],[26,1,26,3],[25,4,25,10],[26,4,26,10],[25,15,25,27],[25,11,25,14],[32,29,32,31],[33,25,33,28],[32,1,32,20],[33,1,33,20],[34,1,34,20],[30,29,31,31],[41,34,41,37],[41,38,41,41],[29,21,29,61],[35,1,36,14],[35,15,36,22],[35,23,36,32],[32,21,32,24],[33,21,33,24],[34,21,34,24],[32,25,32,28],[41,1,41,5],[35,45,35,61],[41,6,41,9],[41,10,41,13],[41,14,41,17],[41,18,41,21],[41,22,41,25],[41,26,41,29],[41,30,41,33],[20,57,20,61],[20,54,20,56],[30,46,31,46],[19,49,19,61],[27,31,27,40],[30,51,31,51],[30,44,31,44],[30,45,31,45],[19,45,19,48],[30,38,31,38],[21,32,21,44],[20,32,20,44],[19,32,19,44],[22,24,22,31],[22,32,22,44],[23,32,23,44],[41,58,41,61],[30,58,31,58],[30,59,31,59],[20,24,20,31],[41,42,41,45],[41,46,41,49],[41,50,41,53],[23,64,23,68],[23,15,23,19],[23,20,23,23],[19,10,19,23],[3,50,3,61],[34,29,34,31],[21,54,21,61],[22,52,22,61],[23,49,23,61],[21,24,21,31],[30,53,31,53],[30,60,31,60],[30,61,31,61],[30,52,31,52],[33,29,33,31],[34,25,34,28],[30,39,31,39],[30,40,31,40],[30,41,31,41],[30,42,31,42],[30,54,31,54],[30,55,31,55],[30,56,31,56],[30,57,31,57],[41,54,41,57],[30,47,31,47],[30,48,31,48],[30,49,31,49],[30,50,31,50],[20,10,20,23],[23,10,23,14],[2,16,2,27],[3,16,3,27],[4,16,4,27],[5,16,5,27],[2,1,2,13],[3,1,3,13],[4,1,4,13],[5,1,5,13],[26,11,26,14],[26,15,26,27],[21,1,21,9],[21,10,21,23],[22,10,22,23],[22,1,22,9],[23,1,23,9],[23,24,23,31],[27,4,27,28]]}
[null,{"$f":"IF(AP1=1,\"Cover Sheet\",\"Deckblatt\")","v":"Cover Sheet"},null,null,null,null,null,null,null,null,null,null,null,null,null,null,null,null,null,null,null,null,null,null,null,null,null,null,null,null,null,null,null,null,null,null,null,null,null,null,null,1,null,null,null,null,null,null,null,null,null,null,null,null,null,null,null,null,null,null,null,"Docu. No.3209 Rev. A "]
[null,{"$f":"IF(AP1=1,\"Sender\",\"Absender:\")","v":"Sender"},null,null,null,null,null,null,null,null,null,null,null,null,null,null,{"$f":"IF(AP1=1,\"Address\",\"Empfänger:\")","v":"Address"},null,null,null,null,null,null,null,null,null,null,null,null,null,null,{"$f":"IF(AP1=1,\"Report production process and product release\",\"Bericht Produktionsprozess- und Produktfreigabe\")","v":"Report production process and product release"},null,null,null,null,null,null,null,null,null,null,null,null,null,null,null,null,null,{"$f":"IF(AP1=1,\"Preliminary stage\",\"Vorlagestufe:\")","v":"Preliminary stage"}]
[null,null,null,null,null,null,null,null,null,null,null,null,null,null,null,null,null,null,null,null,null,null,null,null,null,null,null,null,null,null,null,{"$f":"IF(AP1=1,\"Report other sampels\",\"Bericht sonstige Muster\")","v":"Report other sampels"},null,null,null,null,null,null,null,null,null,null,null,null,null,null,null,null,null,null,{"$f":"IF(AP1=1,\"Re-sampling\",\"Nachbemusterung\")","v":"Re-sampling"}]
[null,null,null,null,null,null,null,null,null,null,null,null,null,null,null,null,null,null,null,null,null,null,null,null,null,null,null,null,null,null,null,null,{"$f":"IF(AP1=1,\"Production relocation\",\"Bemusterung\")","v":"Production relocation"},null,null,null,null,null,null,null,null,null,null,null,null,null,null,null,null,null,{"$f":"IF(AP1=1,\"Stoppage  production for longer than 12 months\",\"Aussetzen der Fertigung länger als 12 Monate\")","v":"Stoppage  production for longer than 12 months"}]
[null,null,null,null,null,null,null,null,null,null,null,null,null,null,null,null,null,null,null,null,null,null,null,null,null,null,null,null,null,null,null,null,null,{"$f":"IF(AP1=1,\"Initial sample inspection\",\"Neuteil\")","v":"Initial sample inspection"},null,null,null,null,null,null,null,null,null,null,null,null,null,null,null,null,{"$f":"IF(AP1=1,\"Changes in the supply chain\",\"Änderungen in der Lieferkette\")","v":"Changes in the supply chain"}]
[null,null,null,null,null,null,null,null,null,null,null,null,null,null,null,null,null,null,null,null,null,null,null,null,null,null,null,null,null,null,null,null,null,{"$f":"IF(AP1=1,\"Changes to the product \",\"Änderungen am Produkt:\")","v":"Changes to the product "}]
[null,null,null,null,null,null,null,null,null,null,null,null,null,null,null,null,null,null,null,null,null,null,null,null,null,null,null,null,null,null,null,null,null,{"$f":"IF(AP1=1,\"Change in product process\",\"Änderung am Produktinsprozess:\")","v":"Change in product process"}]
[]
[null,"Anlagen/Einsichtnahme"]
[null,{"$f":"IF(AP1=1,\"Appendices\",\"Produkt /Prozess\")","v":"Appendices"}]
[null,null,"1.1",{"$f":"IF(AP1=1,\"Dimensional Check\",\"Geometrie, Maßprüfung\")","v":"Dimensional Check"},null,null,null,null,null,null,null,null,null,null,null,null,null,"1.9",{"$f":"IF(AP1=1,\"ESD Test\",\"ESD - Prüfung\")","v":"ESD Test"},null,null,null,null,null,null,null,null,null,null,null,null,null,null,8,{"$f":"IF(AP1=1,\"Software testing\",\"Softwareprüfbericht\")","v":"Software testing"},null,null,null,null,null,null,null,null,null,null,null,null,null,null,16,{"$f":"IF(AP1=1,\"Inspection and Test Equipment List\",\"Werkzeugübersicht\")","v":"Inspection and Test Equipment List"}]
[null,null,"1.2",{"$f":"IF(AP1=1,\"Functional Test\",\"Funktionsprüfung\")","v":"Functional Test"},null,null,null,null,null,null,null,null,null,null,null,null,null,"1.10",{"$f":"IF(AP1=1,\"Reliability Test\",\"Zuverlässigkeitsprüfung\")","v":"Reliability Test"},null,null,null,null,null,null,null,null,null,null,null,null,null,null,9,{"$f":"IF(AP1=1,\"Process-FMEA\",\"Prozess - FMEA\")","v":"Process-FMEA"},null,null,null,null,null,null,null,null,null,null,null,null,null,null,17,{"$f":"IF(AP1=1,\"RUN&Rate\",\"Nachweis vereinbarte Kapazität\")","v":"RUN&Rate"}]
[null,null,"1.3",{"$f":"IF(AP1=1,\"Material Test\",\"Werkstoffprüfung\")","v":"Material Test"},null,null,null,null,null,null,null,null,null,null,null,null,null,"2",{"$f":"IF(AP1=1,\"Sampel\",\"Muster\")","v":"Sampel"},null,null,null,null,null,null,null,null,null,null,null,null,null,null,10,{"$f":"IF(AP1=1,\"Process flow diagram\",\"Prozessablaufdiagramm\")","v":"Process flow diagram"},null,null,null,null,null,null,null,null,null,null,null,null,null,null,18,{"$f":"IF(AP1=1,\"Written self-assessment\",\"Schriftliche Selbstbewertung\")","v":"Written self-assessment"}]
[null,null,"1.4",{"$f":"IF(AP1=1,\"Haptics\",\"Haptikprüfung\")","v":"Haptics"},null,null,null,null,null,null,null,null,null,null,null,null,null,"3",{"$f":"IF(AP1=1,\"Technical specifications\",\"Technische Spezifikationen\")","v":"Technical specifications"},null,null,null,null,null,null,null,null,null,null,null,null,null,null,11,{"$f":"IF(AP1=1,\"Material data sheet IMDS\",\"Produktionslenkungsplan\")","v":"Material data sheet IMDS"},null,null,null,null,null,null,null,null,null,null,null,null,null,null,19,{"$f":"IF(AP1=1,\"Parts history\",\"Teilelebenslauf\")","v":"Parts history"}]
[null,null,"1.5",{"$f":"IF(AP1=1,\"Acoustics\",\"Akustikprüfung\")","v":"Acoustics"},null,null,null,null,null,null,null,null,null,null,null,null,null,"4",{"$f":"IF(AP1=1,\"Product FMEA\",\"Produkt - FMEA\")","v":"Product FMEA"},null,null,null,null,null,null,null,null,null,null,null,null,null,null,12,{"$f":"IF(AP1=1,\"Process capability\",\"Prozessfähigkeitsnachweis\")","v":"Process capability"},null,null,null,null,null,null,null,null,null,null,null,null,null,null,20,{"$f":"IF(AP1=1,\"Packaging \",\"Eignungsnachweis Ladungsträger\")","v":"Packaging "}]
[null,null,"1.6",{"$f":"IF(AP1=1,\"Odors\",\"Geruchsprüfung\")","v":"Odors"},null,null,null,null,null,null,null,null,null,null,null,null,null,"5",{"$f":"IF(AP1=1,\"Construction release\",\"Konstruktionsfreigabe\")","v":"Construction release"},null,null,null,null,null,null,null,null,null,null,null,null,null,null,13,{"$f":"IF(AP1=1,\"Certificate\",\"Absicherung besondere Merkmale\")","v":"Certificate"},null,null,null,null,null,null,null,null,null,null,null,null,null,null,21,{"$f":"IF(AP1=1,\"PPF status supply chain\",\"PPF Status Lieferkette\")","v":"PPF status supply chain"}]
[null,null,"1.7",{"$f":"IF(AP1=1,\"Appearance\",\"Aussehensprüfung\")","v":"Appearance"},null,null,null,null,null,null,null,null,null,null,null,null,null,"6",{"$f":"IF(AP1=1,\"Compliance with legal requirements\",\"Einhaltung gesetzlicher Forderungen\")","v":"Compliance with legal requirements"},null,null,null,null,null,null,null,null,null,null,null,null,null,null,14,{"$f":"IF(AP1=1,\"Test equipment list\",\"Prüfmittelliste\")","v":"Test equipment list"},null,null,null,null,null,null,null,null,null,null,null,null,null,null,22,{"$f":"IF(AP1=1,\"Process acceptance\",\"Freigabe von Beschichtungssystemen\")","v":"Process acceptance"}]
[null,null,"1.8",{"$f":"IF(AI3=1,\"Surface Check\",\"Oberflächenprüfung\")","v":"Oberflächenprüfung"},null,null,null,null,null,null,null,null,null,null,null,null,null,"7",{"$f":"IF(AP1=1,\"Material data sheet / IMDS\",\"Materialdatenblatt / IMDS\")","v":"Material data sheet / IMDS"},null,null,null,null,null,null,null,null,null,null,null,null,null,null,15,{"$f":"IF(AP1=1,\"Evidence of Inspection and Test Equipment Capability\",\"Prüfmittelfähigkeitsnachweis\")","v":"Evidence of Inspection and Test Equipment Capability"},null,null,null,null,null,null,null,null,null,null,null,null,null,null,23,{"$f":"IF(AP1=1,\"Others\",\"Sonstiges\")","v":"Others"}]
[null,{"$f":"IF(AP1=1,\"Supplier Information:\",\"Lieferantenangaben\")","v":"Supplier Information:"}]
[null,{"$f":"IF(AP1=1,\"Supplier/ Productin Location :\",\"Lieferant/Produktionsstandort:\")","v":"Supplier/ Productin Location :"},null,null,null,null,null,null,null,null,null,null,null,null,null,null,null,null,null,null,null,null,null,null,{"$f":"IF(AP1=1,\"Code number /DUNS :\",\"Kennnummer /DUNS:\")","v":"Code number /DUNS :"},null,null,null,null,null,null,null,null,null,null,null,null,null,null,null,null,null,null,null,null,{"$f":"IF(AP1=1,\"Customer:\",\" Kunde:\")","v":"Customer:"}]
[null,{"$f":"IF(AP1=1,\"Part description:\",\"Benennung:\")","v":"Part description:"},null,null,null,null,null,null,null,null,null,null,null,null,null,null,null,null,null,null,null,null,null,null,{"$f":"IF(AP1=1,\"Delivery Note No.:\",\"Lieferschein-Nr.:\")","v":"Delivery Note No.:"},null,null,null,null,null,null,null,null,null,null,null,null,null,null,null,null,null,null,null,null,{"$f":"IF(AP1=1,\"Report No.:\",\"Berichts-Nr.:\")","v":"Report No.:"},null,null,null,null,null,null,null,null,{"$f":"IF(AP1=1,\"Revision:\",\"Version:\")","v":"Revision:"}]
[null,{"$f":"IF(AP1=1,\"Part No.:\",\"Sachnummer:\")","v":"Part No.:"},null,null,null,null,null,null,null,null,null,null,null,null,null,null,null,null,null,null,null,null,null,null,{"$f":"IF(AP1=1,\"Quantity delivered\",\"Liefermenge:\")","v":"Quantity delivered"},null,null,null,null,null,null,null,null,null,null,null,null,null,null,null,null,null,null,null,null,{"$f":"IF(AP1=1,\"Incoming Goods No./ Date\",\"Wareneingangs-Nr./-Datum\")","v":"Incoming Goods No./ Date"}]
[null,{"$f":"IF(AP1=1,\"Drawing Number:\",\"Zeichnungsnummer:\")","v":"Drawing Number:"},null,null,null,null,null,null,null,null,null,null,null,null,null,null,null,null,null,null,null,null,null,null,{"$f":"IF(AP1=1,\"Charge Number:\",\"Chargennummer:\")","v":"Charge Number:"},null,null,null,null,null,null,null,null,null,null,null,null,null,null,null,null,null,null,null,null,{"$f":"IF(AP1=1,\"Order Call-off No./Date:\",\"Bestellabruf-Nr./Datum:\")","v":"Order Call-off No./Date:"}]
[null,{"$f":"IF(AP1=1,\"Status / Date:\",\"Stand / Datum:\")","v":"Status / Date:"},null,null,null,null,null,null,null,null,null,null,null,null,null,{"$f":"IF(AP1=1,\"Revision No.:\",\"Änderungs-Nr.:\")","v":"Revision No.:"},null,null,null,null,null,null,null,null,{"$f":"IF(AP1=1,\"Sample Weight\",\"Mustergewicht:\")","v":"Sample Weight"},null,null,null,null,null,null,null,null,null,null,null,null,null,null,null,null,null,null,null,null,{"$f":"IF(AP1=1,\"Delivery Destination:\",\"Abladestelle:\")","v":"Delivery Destination:"}]
[null,{"$f":"IF(AP1=1,\"Supplier Confirmation - It is hereby confirmed, that the sampling has been carried out according to VDA Volume 2. \",\"Bestätigung Lieferant - Hiermit wird bestätigt, dass die Bemusterung entsprechend den vereinbarten Vorlagestufen gemäß VDA Band 2, durchgeführt wurde.\")","v":"Supplier Confirmation - It is hereby confirmed, that the sampling has been carried out according to VDA Volume 2. "}]
[null,{"$f":"IF(AP1=1,\"Name:\",\"Name:\")","v":"Name:"},null,null,null,null,null,null,null,null,null,{"$f":"IF(AP1=1,\"Telephone:\",\"Telefon:\")","v":"Telephone:"},null,null,null,null,null,null,null,null,null,null,null,null,null,null,null,null,null,null,null,{"$f":"IF(AP1=1,\"The IMDS record was created under the IMDS ID no.:\",\"Der IMDS-Datensatz wurde erstellt unter der IMDS-ID-Nr.:\")","v":"The IMDS record was created under the IMDS ID no.:"}]
[null,{"$f":"IF(AP1=1,\"Department:\",\"Abteilung:\")","v":"Department:"},null,null,null,null,null,null,null,null,null,{"$f":"IF(AP1=1,\"Fax/E-Mail:\",\"Fax / E-Mail:\")","v":"Fax/E-Mail:"}]
[null,{"$f":"IF(AP1=1,\"Comment:\",\"Bemerkung:\")","v":"Comment:"},null,null,null,null,null,null,null,null,null,null,null,null,null,null,null,null,null,null,null,null,null,null,null,null,null,null,null,{"$f":"IF(AP1=1,\"Date:\",\"Datum:\")","v":"Date:"},null,null,null,null,null,null,null,null,null,null,null,{"$f":"IF(AP1=1,\"Signature\",\"Unterschrift:\")","v":"Signature"}]
[null,{"$f":"IF(AP1=1,\"Customer Decision:\",\"Entscheidung Kunde\")","v":"Customer Decision:"},null,null,null,null,null,null,null,null,null,null,null,null,null,null,null,null,null,null,null,{"$f":"IF(AP1=1,\"Release\",\"Freigaben\")","v":"Release"}]
[null,null,null,null,null,null,null,null,null,null,null,null,null,null,null,null,null,null,null,null,null,{"$f":"IF(AP1=1,\"Product/Process:\",\"Produkt / Prozess\")","v":"Product/Process:"}]
[null,null,null,null,null,null,null,null,null,null,null,null,null,null,null,null,null,null,null,null,null,{"$f":"IF(AP1=1,\"Total:\",\"Gesamt\")","v":"Total:"},{"$f":"IF(AI4=1,\"Date:\",\"Datum:\")","v":"Datum:"},"Datum:","Datum:",{"$f":"IF(AP1=1,\"Total process\",\"Gesamt Prozess\")","v":"Total process"},null,null,null,{"$f":"IF(AP1=1,\"Total product\",\"Gesamt Prozess\")","v":"Total product"},null,null,"1.1","1.2","1.3","1.4","1.5","1.6","1.7","1.8","1.9","1.10","2","3","4","5","6","7","8","11","12","13","14","15","16","17","18","19","20","21","22","23"]
[null,null,null,null,null,null,null,null,null,null,null,null,null,null,null,null,null,null,null,null,null,{"$f":"IF(AH5=1,\"Date:\",\"Datum:\")","v":"Datum:"},"Datum:","Datum:","Datum:"]
[null,{"$f":"IF(AP1=1,\"Approved\",\"i.O\")","v":"Approved"}]
[null,{"$f":"IF(AP1=1,\"Conditionally approved\",\"bedingt i.O. Nachbemusterung erforderlich\")","v":"Conditionally approved"}]
[null,{"$f":"IF(AP1=1,\"Rejected, re-sampling necessary\",\"n.i.O. - Nachbemusterung erforderlich\")","v":"Rejected, re-sampling necessary"}]
[null,{"$f":"IF(AP1=1,\"Concession No.:\",\"Nr. Abweichgenehmigung:\")","v":"Concession No.:"},null,null,null,null,null,null,null,null,null,null,null,null,null,{"$f":"IF(AP1=1,\"Date of Expiry:\",\"Gültig bis:\")","v":"Date of Expiry:"},null,null,null,null,null,null,null,{"$f":"IF(AP1=1,\"Quantity:\",\"Stückzahl:\")","v":"Quantity:"},null,null,null,null,null,null,null,null,null,{"$f":"IF(AP1=1,\"Date re-sampling:\",\"Termin Nachbemusterung:\")","v":"Date re-sampling:"},null,null,null,null,null,null,null,null,null,null,null,{"$f":"IF(AP1=1,\"When returning, Delivery note No./Date:\",\"bei Rücksendung Lieferschein-Nr./ -datum:\")","v":"When returning, Delivery note No./Date:"}]
[]
[null,{"$f":"IF(AP1=1,\"Name:\",\"Name:\")","v":"Name:"},null,null,null,null,null,null,null,null,null,{"$f":"IF(AP1=1,\"Telephone:\",\"Telefon:\")","v":"Telephone:"}]
[]
[null,{"$f":"IF(AP1=1,\"Department:\",\"Abteilung:\")","v":"Department:"},null,null,null,null,null,null,null,null,null,{"$f":"IF(AP1=1,\"Fax/E-Mail:\",\"Fax / E-Mail:\")","v":"Fax/E-Mail:"}]
[null,{"$f":"IF(AP1=1,\"Comment:\",\"Bemerkung:\")","v":"Comment:"},null,null,null,null,null,null,null,null,null,null,null,null,null,null,null,null,null,null,null,null,null,null,null,null,null,null,null,null,null,null,null,null,null,null,{"$f":"IF(AP1=1,\"Date:\",\"Datum:\")","v":"Date:"},null,null,null,null,null,null,null,null,null,null,null,{"$f":"IF(AP1=1,\"Signature\",\"Unterschrift:\")","v":"Signature"}]
[null,{"$f":"IF(AP1=1,\"Distributor:\",\"Verteiler:\")","v":"Distributor:"},null,null,null,null,1,null,null,null,2,null,null,null,3,null,null,null,4,null,null,null,5,null,null,null,6,null,null,null,7,null,null,null,8,null,null,null,9,null,null,null,10,null,null,null,11,null,null,null,12,null,null,null,13,null,null,null,14]

{"sheet":"Tabelle zu 3.5a","index":1,"n_rows":55,"n_cols":2,"rows_kept":55,"cut":false,"hidden":true,"merged":[]}
[]
["Grundlage für das Diagramm im Formblatt 3.5a \"IMS-Verfahren1\" !"]
[]
[]
["Reihe 1",{"$f":"#REF!","v":{"$error":"#REF!"}}]
[null,{"$f":"#REF!","v":{"$error":"#REF!"}}]
[null,{"$f":"#REF!","v":{"$error":"#REF!"}}]
[null,{"$f":"#REF!","v":{"$error":"#REF!"}}]
[null,{"$f":"#REF!","v":{"$error":"#REF!"}}]
[null,{"$f":"#REF!","v":{"$error":"#REF!"}}]
[null,{"$f":"#REF!","v":{"$error":"#REF!"}}]
[null,{"$f":"#REF!","v":{"$error":"#REF!"}}]
[null,{"$f":"#REF!","v":{"$error":"#REF!"}}]
[null,{"$f":"#REF!","v":{"$error":"#REF!"}}]
["Reihe 2",{"$f":"#REF!","v":{"$error":"#REF!"}}]
[null,{"$f":"#REF!","v":{"$error":"#REF!"}}]
[null,{"$f":"#REF!","v":{"$error":"#REF!"}}]
[null,{"$f":"#REF!","v":{"$error":"#REF!"}}]
[null,{"$f":"#REF!","v":{"$error":"#REF!"}}]
[null,{"$f":"#REF!","v":{"$error":"#REF!"}}]
[null,{"$f":"#REF!","v":{"$error":"#REF!"}}]
[null,{"$f":"#REF!","v":{"$error":"#REF!"}}]
[null,{"$f":"#REF!","v":{"$error":"#REF!"}}]
[null,{"$f":"#REF!","v":{"$error":"#REF!"}}]
["Reihe 3",{"$f":"#REF!","v":{"$error":"#REF!"}}]
[null,{"$f":"#REF!","v":{"$error":"#REF!"}}]
[null,{"$f":"#REF!","v":{"$error":"#REF!"}}]
[null,{"$f":"#REF!","v":{"$error":"#REF!"}}]
[null,{"$f":"#REF!","v":{"$error":"#REF!"}}]
[null,{"$f":"#REF!","v":{"$error":"#REF!"}}]
[null,{"$f":"#REF!","v":{"$error":"#REF!"}}]
[null,{"$f":"#REF!","v":{"$error":"#REF!"}}]
[null,{"$f":"#REF!","v":{"$error":"#REF!"}}]
[null,{"$f":"#REF!","v":{"$error":"#REF!"}}]
["Reihe 4",{"$f":"#REF!","v":{"$error":"#REF!"}}]
[null,{"$f":"#REF!","v":{"$error":"#REF!"}}]
[null,{"$f":"#REF!","v":{"$error":"#REF!"}}]
[null,{"$f":"#REF!","v":{"$error":"#REF!"}}]
[null,{"$f":"#REF!","v":{"$error":"#REF!"}}]
[null,{"$f":"#REF!","v":{"$error":"#REF!"}}]
[null,{"$f":"#REF!","v":{"$error":"#REF!"}}]
[null,{"$f":"#REF!","v":{"$error":"#REF!"}}]
[null,{"$f":"#REF!","v":{"$error":"#REF!"}}]
[null,{"$f":"#REF!","v":{"$error":"#REF!"}}]
["Reihe 5",{"$f":"#REF!","v":{"$error":"#REF!"}}]
[null,{"$f":"#REF!","v":{"$error":"#REF!"}}]
[null,{"$f":"#REF!","v":{"$error":"#REF!"}}]
[null,{"$f":"#REF!","v":{"$error":"#REF!"}}]
[null,{"$f":"#REF!","v":{"$error":"#REF!"}}]
[null,{"$f":"#REF!","v":{"$error":"#REF!"}}]
[null,{"$f":"#REF!","v":{"$error":"#REF!"}}]
[null,{"$f":"#REF!","v":{"$error":"#REF!"}}]
[null,{"$f":"#REF!","v":{"$error":"#REF!"}}]
[null,{"$f":"#REF!","v":{"$error":"#REF!"}}]
["Ende Testreihe"]

{"sheet":"Tabelle zu 3.5b","index":2,"n_rows":34,"n_cols":4,"rows_kept":34,"cut":false,"hidden":true,"merged":[]}
[]
["Grundlage für das Diagramm im Formblatt 3.5b  \"IMS-Verfahren2\" !"]
[]
[null,"Messwerte",null,"OEGR"]
["Prüfer A",{"$f":"#REF!","v":{"$error":"#REF!"}},null,{"$f":"#REF!","v":{"$error":"#REF!"}}]
[null,{"$f":"#REF!","v":{"$error":"#REF!"}},null,{"$f":"D5","v":{"$error":"#REF!"}}]
[null,{"$f":"#REF!","v":{"$error":"#REF!"}},null,{"$f":"D6","v":{"$error":"#REF!"}}]
[null,{"$f":"#REF!","v":{"$error":"#REF!"}},null,{"$error":"#REF!"}]
[null,{"$f":"#REF!","v":{"$error":"#REF!"}},null,{"$error":"#REF!"}]
[null,{"$f":"#REF!","v":{"$error":"#REF!"}},null,{"$error":"#REF!"}]
[null,{"$f":"#REF!","v":{"$error":"#REF!"}},null,{"$error":"#REF!"}]
[null,{"$f":"#REF!","v":{"$error":"#REF!"}},null,{"$error":"#REF!"}]
[null,{"$f":"#REF!","v":{"$error":"#REF!"}},null,{"$error":"#REF!"}]
[null,{"$f":"#REF!","v":{"$error":"#REF!"}},null,{"$error":"#REF!"}]
["Prüfer B",{"$f":"#REF!","v":{"$error":"#REF!"}},null,{"$error":"#REF!"}]
[null,{"$f":"#REF!","v":{"$error":"#REF!"}},null,{"$error":"#REF!"}]
[null,{"$f":"#REF!","v":{"$error":"#REF!"}},null,{"$error":"#REF!"}]
[null,{"$f":"#REF!","v":{"$error":"#REF!"}},null,{"$error":"#REF!"}]
[null,{"$f":"#REF!","v":{"$error":"#REF!"}},null,{"$error":"#REF!"}]
[null,{"$f":"#REF!","v":{"$error":"#REF!"}},null,{"$error":"#REF!"}]
[null,{"$f":"#REF!","v":{"$error":"#REF!"}},null,{"$error":"#REF!"}]
[null,{"$f":"#REF!","v":{"$error":"#REF!"}},null,{"$error":"#REF!"}]
[null,{"$f":"#REF!","v":{"$error":"#REF!"}},null,{"$error":"#REF!"}]
[null,{"$f":"#REF!","v":{"$error":"#REF!"}},null,{"$error":"#REF!"}]
["Prüfer C",{"$f":"#REF!","v":{"$error":"#REF!"}},null,{"$error":"#REF!"}]
[null,{"$f":"#REF!","v":{"$error":"#REF!"}},null,{"$error":"#REF!"}]
[null,{"$f":"#REF!","v":{"$error":"#REF!"}},null,{"$error":"#REF!"}]
[null,{"$f":"#REF!","v":{"$error":"#REF!"}},null,{"$error":"#REF!"}]
[null,{"$f":"#REF!","v":{"$error":"#REF!"}},null,{"$error":"#REF!"}]
[null,{"$f":"#REF!","v":{"$error":"#REF!"}},null,{"$error":"#REF!"}]
[null,{"$f":"#REF!","v":{"$error":"#REF!"}},null,{"$error":"#REF!"}]
[null,{"$f":"#REF!","v":{"$error":"#REF!"}},null,{"$error":"#REF!"}]
[null,{"$f":"#REF!","v":{"$error":"#REF!"}},null,{"$error":"#REF!"}]
[null,{"$f":"#REF!","v":{"$error":"#REF!"}},null,{"$error":"#REF!"}]

{"sheet":"Tabelle zu 3.11","index":3,"n_rows":158,"n_cols":6,"rows_kept":158,"cut":false,"hidden":true,"merged":[[2,1,2,2],[2,3,2,4]]}
["Grundlage für das Diagramm im Formblatt 3.10b "]
[]
[null,"X",null,"S"]
["Anzahl Messungen","OEG","UEG","OEG","UEG"]
[1,{"$f":"#REF!","v":{"$error":"#REF!"}},{"$f":"#REF!","v":{"$error":"#REF!"}},{"$f":"#REF!","v":{"$error":"#REF!"}},{"$f":"#REF!","v":{"$error":"#REF!"}}]
[2,{"$f":"B5","v":{"$error":"#REF!"}},{"$f":"C5","v":{"$error":"#REF!"}},{"$f":"D5","v":{"$error":"#REF!"}},{"$f":"E5","v":{"$error":"#REF!"}}]
[3,{"$f":"B6","v":{"$error":"#REF!"}},{"$error":"#REF!"},{"$error":"#REF!"},{"$error":"#REF!"}]
[4,{"$error":"#REF!"},{"$error":"#REF!"},{"$error":"#REF!"},{"$error":"#REF!"}]
[5,{"$error":"#REF!"},{"$error":"#REF!"},{"$error":"#REF!"},{"$error":"#REF!"}]
[6,{"$error":"#REF!"},{"$error":"#REF!"},{"$error":"#REF!"},{"$error":"#REF!"}]
[7,{"$error":"#REF!"},{"$error":"#REF!"},{"$error":"#REF!"},{"$error":"#REF!"}]
[8,{"$error":"#REF!"},{"$error":"#REF!"},{"$error":"#REF!"},{"$error":"#REF!"}]
[9,{"$error":"#REF!"},{"$error":"#REF!"},{"$error":"#REF!"},{"$error":"#REF!"}]
[10,{"$error":"#REF!"},{"$error":"#REF!"},{"$error":"#REF!"},{"$error":"#REF!"}]
[11,{"$error":"#REF!"},{"$error":"#REF!"},{"$error":"#REF!"},{"$error":"#REF!"}]
[12,{"$error":"#REF!"},{"$error":"#REF!"},{"$error":"#REF!"},{"$error":"#REF!"}]
[13,{"$error":"#REF!"},{"$error":"#REF!"},{"$error":"#REF!"},{"$error":"#REF!"}]
[14,{"$error":"#REF!"},{"$error":"#REF!"},{"$error":"#REF!"},{"$error":"#REF!"}]
[15,{"$error":"#REF!"},{"$error":"#REF!"},{"$error":"#REF!"},{"$error":"#REF!"}]
[16,{"$error":"#REF!"},{"$error":"#REF!"},{"$error":"#REF!"},{"$error":"#REF!"}]
[17,{"$error":"#REF!"},{"$error":"#REF!"},{"$error":"#REF!"},{"$error":"#REF!"}]
[18,{"$error":"#REF!"},{"$error":"#REF!"},{"$error":"#REF!"},{"$error":"#REF!"},"  "]
[19,{"$error":"#REF!"},{"$error":"#REF!"},{"$error":"#REF!"},{"$error":"#REF!"}]
[20,{"$error":"#REF!"},{"$error":"#REF!"},{"$error":"#REF!"},{"$error":"#REF!"}]
[21,{"$error":"#REF!"},{"$error":"#REF!"},{"$error":"#REF!"},{"$error":"#REF!"}]
[22,{"$error":"#REF!"},{"$error":"#REF!"},{"$error":"#REF!"},{"$error":"#REF!"}]
[23,{"$error":"#REF!"},{"$error":"#REF!"},{"$error":"#REF!"},{"$error":"#REF!"}]
[24,{"$error":"#REF!"},{"$error":"#REF!"},{"$error":"#REF!"},{"$error":"#REF!"}]
[25,{"$error":"#REF!"},{"$error":"#REF!"},{"$error":"#REF!"},{"$error":"#REF!"}]
[]
[]
["Messwerte"]
[]
[{"$f":"#REF!","v":{"$error":"#REF!"}}]
[{"$f":"#REF!","v":{"$error":"#REF!"}}]
[{"$f":"#REF!","v":{"$error":"#REF!"}}]
[{"$f":"#REF!","v":{"$error":"#REF!"}}]
[{"$f":"#REF!","v":{"$error":"#REF!"}}]
[{"$f":"#REF!","v":{"$error":"#REF!"}}]
[{"$f":"#REF!","v":{"$error":"#REF!"}}]
[{"$f":"#REF!","v":{"$error":"#REF!"}}]
[{"$f":"#REF!","v":{"$error":"#REF!"}}]
[{"$f":"#REF!","v":{"$error":"#REF!"}}]
[{"$f":"#REF!","v":{"$error":"#REF!"}}]
[{"$f":"#REF!","v":{"$error":"#REF!"}}]
[{"$f":"#REF!","v":{"$error":"#REF!"}}]
[{"$f":"#REF!","v":{"$error":"#REF!"}}]
[{"$f":"#REF!","v":{"$error":"#REF!"}}]
[{"$f":"#REF!","v":{"$error":"#REF!"}}]
[{"$f":"#REF!","v":{"$error":"#REF!"}}]
[{"$f":"#REF!","v":{"$error":"#REF!"}}]
[{"$f":"#REF!","v":{"$error":"#REF!"}}]
[{"$f":"#REF!","v":{"$error":"#REF!"}}]
[{"$f":"#REF!","v":{"$error":"#REF!"}}]
[{"$f":"#REF!","v":{"$error":"#REF!"}}]
[{"$f":"#REF!","v":{"$error":"#REF!"}}]
[{"$f":"#REF!","v":{"$error":"#REF!"}}]
[{"$f":"#REF!","v":{"$error":"#REF!"}},"25 Werte"]
[{"$f":"#REF!","v":{"$error":"#REF!"}}]
[{"$f":"#REF!","v":{"$error":"#REF!"}}]
[{"$f":"#REF!","v":{"$error":"#REF!"}}]
[{"$f":"#REF!","v":{"$error":"#REF!"}}]
[{"$f":"#REF!","v":{"$error":"#REF!"}}]
[{"$f":"#REF!","v":{"$error":"#REF!"}}]
[{"$f":"#REF!","v":{"$error":"#REF!"}}]
[{"$f":"#REF!","v":{"$error":"#REF!"}}]
[{"$f":"#REF!","v":{"$error":"#REF!"}}]
[{"$f":"#REF!","v":{"$error":"#REF!"}}]
[{"$f":"#REF!","v":{"$error":"#REF!"}}]
[{"$f":"#REF!","v":{"$error":"#REF!"}}]
[{"$f":"#REF!","v":{"$error":"#REF!"}}]
[{"$f":"#REF!","v":{"$error":"#REF!"}}]
[{"$f":"#REF!","v":{"$error":"#REF!"}}]
[{"$f":"#REF!","v":{"$error":"#REF!"}}]
[{"$f":"#REF!","v":{"$error":"#REF!"}}]
[{"$f":"#REF!","v":{"$error":"#REF!"}}]
[{"$f":"#REF!","v":{"$error":"#REF!"}}]
[{"$f":"#REF!","v":{"$error":"#REF!"}}]
[{"$f":"#REF!","v":{"$error":"#REF!"}}]
[{"$f":"#REF!","v":{"$error":"#REF!"}}]
[{"$f":"#REF!","v":{"$error":"#REF!"}}]
[{"$f":"#REF!","v":{"$error":"#REF!"}}]
[{"$f":"#REF!","v":{"$error":"#REF!"}},"50 Werte"]
[{"$f":"#REF!","v":{"$error":"#REF!"}}]
[{"$f":"#REF!","v":{"$error":"#REF!"}}]
[{"$f":"#REF!","v":{"$error":"#REF!"}}]
[{"$f":"#REF!","v":{"$error":"#REF!"}}]
[{"$f":"#REF!","v":{"$error":"#REF!"}}]
[{"$f":"#REF!","v":{"$error":"#REF!"}}]
[{"$f":"#REF!","v":{"$error":"#REF!"}}]
[{"$f":"#REF!","v":{"$error":"#REF!"}}]
[{"$f":"#REF!","v":{"$error":"#REF!"}}]
[{"$f":"#REF!","v":{"$error":"#REF!"}}]
[{"$f":"#REF!","v":{"$error":"#REF!"}}]
[{"$f":"#REF!","v":{"$error":"#REF!"}}]
[{"$f":"#REF!","v":{"$error":"#REF!"}}]
[{"$f":"#REF!","v":{"$error":"#REF!"}}]
[{"$f":"#REF!","v":{"$error":"#REF!"}}]
[{"$f":"#REF!","v":{"$error":"#REF!"}}]
[{"$f":"#REF!","v":{"$error":"#REF!"}}]
[{"$f":"#REF!","v":{"$error":"#REF!"}}]
[{"$f":"#REF!","v":{"$error":"#REF!"}}]
[{"$f":"#REF!","v":{"$error":"#REF!"}}]
[{"$f":"#REF!","v":{"$error":"#REF!"}}]
[{"$f":"#REF!","v":{"$error":"#REF!"}}]
[{"$f":"#REF!","v":{"$error":"#REF!"}}]
[{"$f":"#REF!","v":{"$error":"#REF!"}}]
[{"$f":"#REF!","v":{"$error":"#REF!"}},"75 Werte"]
[{"$f":"#REF!","v":{"$error":"#REF!"}}]
[{"$f":"#REF!","v":{"$error":"#REF!"}}]
[{"$f":"#REF!","v":{"$error":"#REF!"}}]
[{"$f":"#REF!","v":{"$error":"#REF!"}}]
[{"$f":"#REF!","v":{"$error":"#REF!"}}]
[{"$f":"#REF!","v":{"$error":"#REF!"}}]
[{"$f":"#REF!","v":{"$error":"#REF!"}}]
[{"$f":"#REF!","v":{"$error":"#REF!"}}]
[{"$f":"#REF!","v":{"$error":"#REF!"}}]
[{"$f":"#REF!","v":{"$error":"#REF!"}}]
[{"$f":"#REF!","v":{"$error":"#REF!"}}]
[{"$f":"#REF!","v":{"$error":"#REF!"}}]
[{"$f":"#REF!","v":{"$error":"#REF!"}}]
[{"$f":"#REF!","v":{"$error":"#REF!"}}]
[{"$f":"#REF!","v":{"$error":"#REF!"}}]
[{"$f":"#REF!","v":{"$error":"#REF!"}}]
[{"$f":"#REF!","v":{"$error":"#REF!"}}]
[{"$f":"#REF!","v":{"$error":"#REF!"}}]
[{"$f":"#REF!","v":{"$error":"#REF!"}}]
[{"$f":"#REF!","v":{"$error":"#REF!"}}]
[{"$f":"#REF!","v":{"$error":"#REF!"}}]
[{"$f":"#REF!","v":{"$error":"#REF!"}}]
[{"$f":"#REF!","v":{"$error":"#REF!"}}]
[{"$f":"#REF!","v":{"$error":"#REF!"}}]
[{"$f":"#REF!","v":{"$error":"#REF!"}},"100 Werte"]
[{"$f":"#REF!","v":{"$error":"#REF!"}}]
[{"$f":"#REF!","v":{"$error":"#REF!"}}]
[{"$f":"#REF!","v":{"$error":"#REF!"}}]
[{"$f":"#REF!","v":{"$error":"#REF!"}}]
[{"$f":"#REF!","v":{"$error":"#REF!"}}]
[{"$f":"#REF!","v":{"$error":"#REF!"}}]
[{"$f":"#REF!","v":{"$error":"#REF!"}}]
[{"$f":"#REF!","v":{"$error":"#REF!"}}]
[{"$f":"#REF!","v":{"$error":"#REF!"}}]
[{"$f":"#REF!","v":{"$error":"#REF!"}}]
[{"$f":"#REF!","v":{"$error":"#REF!"}}]
[{"$f":"#REF!","v":{"$error":"#REF!"}}]
[{"$f":"#REF!","v":{"$error":"#REF!"}}]
[{"$f":"#REF!","v":{"$error":"#REF!"}}]
[{"$f":"#REF!","v":{"$error":"#REF!"}}]
[{"$f":"#REF!","v":{"$error":"#REF!"}}]
[{"$f":"#REF!","v":{"$error":"#REF!"}}]
[{"$f":"#REF!","v":{"$error":"#REF!"}}]
[{"$f":"#REF!","v":{"$error":"#REF!"}}]
[{"$f":"#REF!","v":{"$error":"#REF!"}}]
[{"$f":"#REF!","v":{"$error":"#REF!"}}]
[{"$f":"#REF!","v":{"$error":"#REF!"}}]
[{"$f":"#REF!","v":{"$error":"#REF!"}}]
[{"$f":"#REF!","v":{"$error":"#REF!"}}]
[{"$f":"#REF!","v":{"$error":"#REF!"}},"125 Werte"]

{"sheet":"Tabelle zu 3.10b","index":4,"n_rows":158,"n_cols":6,"rows_kept":158,"cut":false,"hidden":true,"merged":[[2,1,2,2],[2,3,2,4]]}
["Grundlage für das Diagramm im Formblatt 3.10b "]
[]
[null,"X",null,"S"]
["Anzahl Messungen","OEG","UEG","OEG","UEG"]
[1,{"$f":"#REF!","v":{"$error":"#REF!"}},{"$f":"#REF!","v":{"$error":"#REF!"}},{"$f":"#REF!","v":{"$error":"#REF!"}},{"$f":"#REF!","v":{"$error":"#REF!"}}]
[2,{"$f":"B5","v":{"$error":"#REF!"}},{"$f":"C5","v":{"$error":"#REF!"}},{"$f":"D5","v":{"$error":"#REF!"}},{"$f":"E5","v":{"$error":"#REF!"}}]
[3,{"$f":"B6","v":{"$error":"#REF!"}},{"$f":"C6","v":{"$error":"#REF!"}},{"$f":"D6","v":{"$error":"#REF!"}},{"$f":"E6","v":{"$error":"#REF!"}}]
[4,{"$error":"#REF!"},{"$error":"#REF!"},{"$error":"#REF!"},{"$error":"#REF!"}]
[5,{"$error":"#REF!"},{"$error":"#REF!"},{"$error":"#REF!"},{"$error":"#REF!"}]
[6,{"$error":"#REF!"},{"$error":"#REF!"},{"$error":"#REF!"},{"$error":"#REF!"}]
[7,{"$error":"#REF!"},{"$error":"#REF!"},{"$error":"#REF!"},{"$error":"#REF!"}]
[8,{"$error":"#REF!"},{"$error":"#REF!"},{"$error":"#REF!"},{"$error":"#REF!"}]
[9,{"$error":"#REF!"},{"$error":"#REF!"},{"$error":"#REF!"},{"$error":"#REF!"}]
[10,{"$error":"#REF!"},{"$error":"#REF!"},{"$error":"#REF!"},{"$error":"#REF!"}]
[11,{"$error":"#REF!"},{"$error":"#REF!"},{"$error":"#REF!"},{"$error":"#REF!"}]
[12,{"$error":"#REF!"},{"$error":"#REF!"},{"$error":"#REF!"},{"$error":"#REF!"}]
[13,{"$error":"#REF!"},{"$error":"#REF!"},{"$error":"#REF!"},{"$error":"#REF!"}]
[14,{"$error":"#REF!"},{"$error":"#REF!"},{"$error":"#REF!"},{"$error":"#REF!"}]
[15,{"$error":"#REF!"},{"$error":"#REF!"},{"$error":"#REF!"},{"$error":"#REF!"}]
[16,{"$error":"#REF!"},{"$error":"#REF!"},{"$error":"#REF!"},{"$error":"#REF!"}]
[17,{"$error":"#REF!"},{"$error":"#REF!"},{"$error":"#REF!"},{"$error":"#REF!"}]
[18,{"$error":"#REF!"},{"$error":"#REF!"},{"$error":"#REF!"},{"$error":"#REF!"},"  "]
[19,{"$error":"#REF!"},{"$error":"#REF!"},{"$error":"#REF!"},{"$error":"#REF!"}]
[20,{"$error":"#REF!"},{"$error":"#REF!"},{"$error":"#REF!"},{"$error":"#REF!"}]
[21,{"$error":"#REF!"},{"$error":"#REF!"},{"$error":"#REF!"},{"$error":"#REF!"}]
[22,{"$error":"#REF!"},{"$error":"#REF!"},{"$error":"#REF!"},{"$error":"#REF!"}]
[23,{"$error":"#REF!"},{"$error":"#REF!"},{"$error":"#REF!"},{"$error":"#REF!"}]
[24,{"$error":"#REF!"},{"$error":"#REF!"},{"$error":"#REF!"},{"$error":"#REF!"}]
[25,{"$error":"#REF!"},{"$error":"#REF!"},{"$error":"#REF!"},{"$error":"#REF!"}]
[]
[]
["Messwerte"]
[]
[{"$f":"#REF!","v":{"$error":"#REF!"}}]
[{"$f":"#REF!","v":{"$error":"#REF!"}}]
[{"$f":"#REF!","v":{"$error":"#REF!"}}]
[{"$f":"#REF!","v":{"$error":"#REF!"}}]
[{"$f":"#REF!","v":{"$error":"#REF!"}}]
[{"$f":"#REF!","v":{"$error":"#REF!"}}]
[{"$f":"#REF!","v":{"$error":"#REF!"}}]
[{"$f":"#REF!","v":{"$error":"#REF!"}}]
[{"$f":"#REF!","v":{"$error":"#REF!"}}]
[{"$f":"#REF!","v":{"$error":"#REF!"}}]
[{"$f":"#REF!","v":{"$error":"#REF!"}}]
[{"$f":"#REF!","v":{"$error":"#REF!"}}]
[{"$f":"#REF!","v":{"$error":"#REF!"}}]
[{"$f":"#REF!","v":{"$error":"#REF!"}}]
[{"$f":"#REF!","v":{"$error":"#REF!"}}]
[{"$f":"#REF!","v":{"$error":"#REF!"}}]
[{"$f":"#REF!","v":{"$error":"#REF!"}}]
[{"$f":"#REF!","v":{"$error":"#REF!"}}]
[{"$f":"#REF!","v":{"$error":"#REF!"}}]
[{"$f":"#REF!","v":{"$error":"#REF!"}}]
[{"$f":"#REF!","v":{"$error":"#REF!"}}]
[{"$f":"#REF!","v":{"$error":"#REF!"}}]
[{"$f":"#REF!","v":{"$error":"#REF!"}}]
[{"$f":"#REF!","v":{"$error":"#REF!"}}]
[{"$f":"#REF!","v":{"$error":"#REF!"}},"25 Werte"]
[{"$f":"#REF!","v":{"$error":"#REF!"}}]
[{"$f":"#REF!","v":{"$error":"#REF!"}}]
[{"$f":"#REF!","v":{"$error":"#REF!"}}]
[{"$f":"#REF!","v":{"$error":"#REF!"}}]
[{"$f":"#REF!","v":{"$error":"#REF!"}}]
[{"$f":"#REF!","v":{"$error":"#REF!"}}]
[{"$f":"#REF!","v":{"$error":"#REF!"}}]
[{"$f":"#REF!","v":{"$error":"#REF!"}}]
[{"$f":"#REF!","v":{"$error":"#REF!"}}]
[{"$f":"#REF!","v":{"$error":"#REF!"}}]
[{"$f":"#REF!","v":{"$error":"#REF!"}}]
[{"$f":"#REF!","v":{"$error":"#REF!"}}]
[{"$f":"#REF!","v":{"$error":"#REF!"}}]
[{"$f":"#REF!","v":{"$error":"#REF!"}}]
[{"$f":"#REF!","v":{"$error":"#REF!"}}]
[{"$f":"#REF!","v":{"$error":"#REF!"}}]
[{"$f":"#REF!","v":{"$error":"#REF!"}}]
[{"$f":"#REF!","v":{"$error":"#REF!"}}]
[{"$f":"#REF!","v":{"$error":"#REF!"}}]
[{"$f":"#REF!","v":{"$error":"#REF!"}}]
[{"$f":"#REF!","v":{"$error":"#REF!"}}]
[{"$f":"#REF!","v":{"$error":"#REF!"}}]
[{"$f":"#REF!","v":{"$error":"#REF!"}}]
[{"$f":"#REF!","v":{"$error":"#REF!"}}]
[{"$f":"#REF!","v":{"$error":"#REF!"}},"50 Werte"]
[{"$f":"#REF!","v":{"$error":"#REF!"}}]
[{"$f":"#REF!","v":{"$error":"#REF!"}}]
[{"$f":"#REF!","v":{"$error":"#REF!"}}]
[{"$f":"#REF!","v":{"$error":"#REF!"}}]
[{"$f":"#REF!","v":{"$error":"#REF!"}}]
[{"$f":"#REF!","v":{"$error":"#REF!"}}]
[{"$f":"#REF!","v":{"$error":"#REF!"}}]
[{"$f":"#REF!","v":{"$error":"#REF!"}}]
[{"$f":"#REF!","v":{"$error":"#REF!"}}]
[{"$f":"#REF!","v":{"$error":"#REF!"}}]
[{"$f":"#REF!","v":{"$error":"#REF!"}}]
[{"$f":"#REF!","v":{"$error":"#REF!"}}]
[{"$f":"#REF!","v":{"$error":"#REF!"}}]
[{"$f":"#REF!","v":{"$error":"#REF!"}}]
[{"$f":"#REF!","v":{"$error":"#REF!"}}]
[{"$f":"#REF!","v":{"$error":"#REF!"}}]
[{"$f":"#REF!","v":{"$error":"#REF!"}}]
[{"$f":"#REF!","v":{"$error":"#REF!"}}]
[{"$f":"#REF!","v":{"$error":"#REF!"}}]
[{"$f":"#REF!","v":{"$error":"#REF!"}}]
[{"$f":"#REF!","v":{"$error":"#REF!"}}]
[{"$f":"#REF!","v":{"$error":"#REF!"}}]
[{"$f":"#REF!","v":{"$error":"#REF!"}}]
[{"$f":"#REF!","v":{"$error":"#REF!"}}]
[{"$f":"#REF!","v":{"$error":"#REF!"}},"75 Werte"]
[{"$f":"#REF!","v":{"$error":"#REF!"}}]
[{"$f":"#REF!","v":{"$error":"#REF!"}}]
[{"$f":"#REF!","v":{"$error":"#REF!"}}]
[{"$f":"#REF!","v":{"$error":"#REF!"}}]
[{"$f":"#REF!","v":{"$error":"#REF!"}}]
[{"$f":"#REF!","v":{"$error":"#REF!"}}]
[{"$f":"#REF!","v":{"$error":"#REF!"}}]
[{"$f":"#REF!","v":{"$error":"#REF!"}}]
[{"$f":"#REF!","v":{"$error":"#REF!"}}]
[{"$f":"#REF!","v":{"$error":"#REF!"}}]
[{"$f":"#REF!","v":{"$error":"#REF!"}}]
[{"$f":"#REF!","v":{"$error":"#REF!"}}]
[{"$f":"#REF!","v":{"$error":"#REF!"}}]
[{"$f":"#REF!","v":{"$error":"#REF!"}}]
[{"$f":"#REF!","v":{"$error":"#REF!"}}]
[{"$f":"#REF!","v":{"$error":"#REF!"}}]
[{"$f":"#REF!","v":{"$error":"#REF!"}}]
[{"$f":"#REF!","v":{"$error":"#REF!"}}]
[{"$f":"#REF!","v":{"$error":"#REF!"}}]
[{"$f":"#REF!","v":{"$error":"#REF!"}}]
[{"$f":"#REF!","v":{"$error":"#REF!"}}]
[{"$f":"#REF!","v":{"$error":"#REF!"}}]
[{"$f":"#REF!","v":{"$error":"#REF!"}}]
[{"$f":"#REF!","v":{"$error":"#REF!"}}]
[{"$f":"#REF!","v":{"$error":"#REF!"}},"100 Werte"]
[{"$f":"#REF!","v":{"$error":"#REF!"}}]
[{"$f":"#REF!","v":{"$error":"#REF!"}}]
[{"$f":"#REF!","v":{"$error":"#REF!"}}]
[{"$f":"#REF!","v":{"$error":"#REF!"}}]
[{"$f":"#REF!","v":{"$error":"#REF!"}}]
[{"$f":"#REF!","v":{"$error":"#REF!"}}]
[{"$f":"#REF!","v":{"$error":"#REF!"}}]
[{"$f":"#REF!","v":{"$error":"#REF!"}}]
[{"$f":"#REF!","v":{"$error":"#REF!"}}]
[{"$f":"#REF!","v":{"$error":"#REF!"}}]
[{"$f":"#REF!","v":{"$error":"#REF!"}}]
[{"$f":"#REF!","v":{"$error":"#REF!"}}]
[{"$f":"#REF!","v":{"$error":"#REF!"}}]
[{"$f":"#REF!","v":{"$error":"#REF!"}}]
[{"$f":"#REF!","v":{"$error":"#REF!"}}]
[{"$f":"#REF!","v":{"$error":"#REF!"}}]
[{"$f":"#REF!","v":{"$error":"#REF!"}}]
[{"$f":"#REF!","v":{"$error":"#REF!"}}]
[{"$f":"#REF!","v":{"$error":"#REF!"}}]
[{"$f":"#REF!","v":{"$error":"#REF!"}}]
[{"$f":"#REF!","v":{"$error":"#REF!"}}]
[{"$f":"#REF!","v":{"$error":"#REF!"}}]
[{"$f":"#REF!","v":{"$error":"#REF!"}}]
[{"$f":"#REF!","v":{"$error":"#REF!"}}]
[{"$f":"#REF!","v":{"$error":"#REF!"}},"125 Werte"]

{"sheet":"Tabelle zu 3.5c","index":5,"n_rows":30,"n_cols":5,"rows_kept":30,"cut":false,"hidden":true,"merged":[]}
[]
["Grundlage für das Diagramm im Formblatt  3.5c  \"IMS-Verfahren3\" !"]
[]
[]
[null,null,null,"Wert","Anzahl"]
[null,"OEGR","=",{"$f":"#REF!","v":{"$error":"#REF!"}},1]
[null,null,null,{"$f":"D6","v":{"$error":"#REF!"}},{"$f":"E6+1","v":2}]
[null,null,null,{"$f":"D7","v":{"$error":"#REF!"}},{"$f":"E7+1","v":3}]
[null,null,null,{"$f":"D8","v":{"$error":"#REF!"}},4]
[null,null,null,{"$error":"#REF!"},5]
[null,null,null,{"$error":"#REF!"},6]
[null,null,null,{"$error":"#REF!"},7]
[null,null,null,{"$error":"#REF!"},8]
[null,null,null,{"$error":"#REF!"},9]
[null,null,null,{"$error":"#REF!"},10]
[null,null,null,{"$error":"#REF!"},11]
[null,null,null,{"$error":"#REF!"},12]
[null,null,null,{"$error":"#REF!"},13]
[null,null,null,{"$error":"#REF!"},14]
[null,null,null,{"$error":"#REF!"},15]
[null,null,null,{"$error":"#REF!"},16]
[null,null,null,{"$error":"#REF!"},17]
[null,null,null,{"$error":"#REF!"},18]
[null,null,null,{"$error":"#REF!"},19]
[null,null,null,{"$error":"#REF!"},20]
[null,null,null,{"$error":"#REF!"},21]
[null,null,null,{"$error":"#REF!"},22]
[null,null,null,{"$error":"#REF!"},23]
[null,null,null,{"$error":"#REF!"},24]
[null,null,null,{"$f":"D29","v":{"$error":"#REF!"}},{"$f":"E29+1","v":25}]